{"text_format":"1","workbook":"xlsx","n_sheets":6,"sheets":["TEMİZLE","GENEL TOPLAM","ABD DOLARI","AVRO","İNGİLİZ STERLİNİ","KURLAR"],"not_rendered":{"charts":0,"images":0,"macros":1,"external_links":0,"defined_names":0,"comments":0,"pivot_tables":0},"unopened":[],"bounds":{"document_bytes":16777216,"sheet_cells":100000,"rows_first":2000,"rows_last":500,"rows_between":2000,"halvings":0,"cell_chars":16384,"cell_head_chars":4096},"cells_cut":0,"cells_raw":0,"read":"whole","date_system":"1900"}

{"sheet":"TEMİZLE","index":0,"n_rows":14,"n_cols":2,"rows_kept":14,"cut":false,"hidden":false,"merged":[]}
[]
[]
[]
[]
[]
[]
[]
[]
[]
[]
[]
[]
[]
[null," "]

{"sheet":"GENEL TOPLAM","index":1,"n_rows":23,"n_cols":5,"rows_kept":23,"cut":false,"hidden":false,"merged":[[22,1,22,3]]}
[]
[null,"ABD DOLARI KUR DEĞERLEME KAZANÇ / ZARARI",{"$f":"'ABD DOLARI'!K207","v":0}]
[null,"AVRO KUR DEĞERLEME KAZANÇ / ZARARI",{"$f":"AVRO!K207","v":0}]
[null,"İNGİLİZ STERLİNİ KUR DEĞERLEME KAZANÇ / ZARARI",{"$f":"'İNGİLİZ STERLİNİ'!K207","v":0}]
[null,"GENEL TOPLAM",{"$f":"SUM(C2:C4)","v":0}]
[null,"Dönüşüm Oranı ",{"$f":"C21/C15","v":{"$error":"#DIV/0!"}}]
[null,"DÖNÜŞÜM ORANINA GÖRE YARARLANILABİLECEK TOPLAM KAZANÇ VEYA ZARAR TUTARI",{"$f":"C5*C6","v":{"$error":"#DIV/0!"}}]
[]
[]
[]
[null,"DÖNEM SONU MİKTAR VE TUTARLAR","DÖNEM SONU MİKTAR","DÖNEM SONU KURU","TL DEĞERİ"]
[null,"DÖNEM SONU ABD DOLARI ",{"$f":"'ABD DOLARI'!F3","v":0},{"$f":"'ABD DOLARI'!G3","v":12.977499999999999},{"$f":"C12*D12","v":0}]
[null,"DÖNEM SONU AVRO ",{"$f":"AVRO!F3","v":0},{"$f":"AVRO!G3","v":14.6823},{"$f":"C13*D13","v":0}]
[null,"DÖNEM SONU İNGİLİZ STERLİNİ ",{"$f":"'İNGİLİZ STERLİNİ'!F3","v":0},{"$f":"'İNGİLİZ STERLİNİ'!G3","v":17.452999999999999},0]
[null,"Dönem Sonu Toplam Tutar (TL)",{"$f":"SUM(E12:E14)","v":0}]
[]
[null,"DÖNÜŞTÜRÜLEN YABANCI PARA TUTARI","DÖNÜŞTÜRÜLEN MİKTAR","DÖNEM SONU KURU","TL DEĞERİ"]
[null,"DÖNÜŞTÜRÜLEN ABD DOLARI ",{"$f":"'ABD DOLARI'!I3","v":0},{"$f":"'ABD DOLARI'!G3","v":12.977499999999999},{"$f":"C18*D18","v":0}]
[null,"DÖNÜŞTÜRÜLEN AVRO ",{"$f":"AVRO!I3","v":0},{"$f":"AVRO!G3","v":14.6823},{"$f":"C19*D19","v":0}]
[null,"DÖNÜŞTÜRÜLEN İNGİLİZ STERLİNİ ",{"$f":"'İNGİLİZ STERLİNİ'!I3","v":0},{"$f":"'İNGİLİZ STERLİNİ'!G3","v":17.452999999999999},0]
[null,"DÖNÜŞTÜRÜLEN YABANCI PARA TUTARI(TL)",{"$f":"SUM(E18:E20)","v":0}]
[]
[null,"DÖNÜŞÜM ORANI ",null,null,{"$f":"C21/C15","v":{"$error":"#DIV/0!"}}]

{"sheet":"ABD DOLARI","index":2,"n_rows":207,"n_cols":11,"rows_kept":207,"cut":false,"hidden":false,"merged":[[4,3,4,7],[4,8,4,10],[206,3,206,5]]}
[]
[null,null,null,null,null,null,"Değerlemede Dikkate Alınacak Kur",null,"Kur Korumalı Mevduat Hesabına Aktarılacak Tutar","İstisnadan Yararlanma Oranı","İstisnadan Yararlanabilecek Kazanç Tutarı"]
[null,null,null,null,"DÖVİZ TEVDİAT HESABINDA \n31/12/2021 TARİHİ İTİBARİYLE YER ALAN DÖNEM SONU ABD DOLARI MİKTARI",null,{"$f":"KURLAR!C366","v":12.977499999999999},null,null,{"$f":"I3/F3","v":{"$error":"#DIV/0!"}},{"$f":"K207*J3","v":{"$error":"#DIV/0!"}}]
[]
[null,null,null,"EN SON ALIM YAPILAN DÖVİZLERİN ALIM TARİH VE MİKTAR DURUMU",null,null,null,null,"DEĞERLEME İŞLEMLERİ"]
[null,"30/09/2021 Tarihinin Sayı Değeri","Alım Tarihinin Sayı Değeri","SIRA NO","Alım Tarihi","Yazılabilecek Max Alım Miktarı","Alım Miktarı","Kalan Bir Önceki Max  Alım Miktarı","Değerlemede Dikkate Alınacak Tarih","Değerlemede Dikkate Alınacak Kur","Hesaplanan Kur Farkı Kazancı"]
["2021-09-30",{"$f":"A7","v":44469},{"$f":"E7","v":0},1,null,{"$f":"F3","v":0},null,{"$f":"F3-G7","v":0},{"$f":"IF(C7>=B7,E7,(A7))","v":"2021-09-30"},{"$f":"LOOKUP(I7,KURLAR!B2:B366,KURLAR!C2:C366)","v":8.8432999999999993},{"$f":"G7*($G$3-J7)","v":0}]
["2021-09-30",{"$f":"A8","v":44469},0,2,null,{"$f":"F7-G7","v":0},null,{"$f":"H7-G8","v":0},{"$f":"IF(C8>=B8,E8,(A8))","v":"2021-09-30"},{"$f":"LOOKUP(I8,KURLAR!B3:B367,KURLAR!C3:C367)","v":8.8432999999999993},{"$f":"G8*($G$3-J8)","v":0}]
["2021-09-30",44469,0,3,null,{"$f":"F8-G8","v":0},null,{"$f":"H8-G9","v":0},"2021-09-30",{"$f":"LOOKUP(I9,KURLAR!B4:B368,KURLAR!C4:C368)","v":8.8432999999999993},0]
["2021-09-30",44469,0,4,null,0,null,0,"2021-09-30",{"$f":"LOOKUP(I10,KURLAR!B5:B369,KURLAR!C5:C369)","v":8.8432999999999993},0]
["2021-09-30",44469,0,5,null,0,null,0,"2021-09-30",{"$f":"LOOKUP(I11,KURLAR!B6:B370,KURLAR!C6:C370)","v":8.8432999999999993},0]
["2021-09-30",44469,0,6,null,0,null,0,"2021-09-30",{"$f":"LOOKUP(I12,KURLAR!B7:B371,KURLAR!C7:C371)","v":8.8432999999999993},0]
["2021-09-30",44469,0,7,null,0,null,0,"2021-09-30",{"$f":"LOOKUP(I13,KURLAR!B8:B372,KURLAR!C8:C372)","v":8.8432999999999993},0]
["2021-09-30",44469,0,8,null,0,null,0,"2021-09-30",{"$f":"LOOKUP(I14,KURLAR!B9:B373,KURLAR!C9:C373)","v":8.8432999999999993},0]
["2021-09-30",44469,0,9,null,0,null,0,"2021-09-30",{"$f":"LOOKUP(I15,KURLAR!B10:B374,KURLAR!C10:C374)","v":8.8432999999999993},0]
["2021-09-30",44469,0,10,null,0,null,0,"2021-09-30",{"$f":"LOOKUP(I16,KURLAR!B11:B375,KURLAR!C11:C375)","v":8.8432999999999993},0]
["2021-09-30",44469,0,11,null,0,null,0,"2021-09-30",{"$f":"LOOKUP(I17,KURLAR!B12:B376,KURLAR!C12:C376)","v":8.8432999999999993},0]
["2021-09-30",44469,0,12,null,0,null,0,"2021-09-30",{"$f":"LOOKUP(I18,KURLAR!B13:B377,KURLAR!C13:C377)","v":8.8432999999999993},0]
["2021-09-30",44469,0,13,null,0,null,0,"2021-09-30",{"$f":"LOOKUP(I19,KURLAR!B14:B378,KURLAR!C14:C378)","v":8.8432999999999993},0]
["2021-09-30",44469,0,14,null,0,null,0,"2021-09-30",{"$f":"LOOKUP(I20,KURLAR!B15:B379,KURLAR!C15:C379)","v":8.8432999999999993},0]
["2021-09-30",44469,0,15,null,0,null,0,"2021-09-30",{"$f":"LOOKUP(I21,KURLAR!B16:B380,KURLAR!C16:C380)","v":8.8432999999999993},0]
["2021-09-30",44469,0,16,null,0,null,0,"2021-09-30",{"$f":"LOOKUP(I22,KURLAR!B17:B381,KURLAR!C17:C381)","v":8.8432999999999993},0]
["2021-09-30",44469,0,17,null,0,null,0,"2021-09-30",{"$f":"LOOKUP(I23,KURLAR!B18:B382,KURLAR!C18:C382)","v":8.8432999999999993},0]
["2021-09-30",44469,0,18,null,0,null,0,"2021-09-30",{"$f":"LOOKUP(I24,KURLAR!B19:B383,KURLAR!C19:C383)","v":8.8432999999999993},0]
["2021-09-30",44469,0,19,null,0,null,0,"2021-09-30",{"$f":"LOOKUP(I25,KURLAR!B20:B384,KURLAR!C20:C384)","v":8.8432999999999993},0]
["2021-09-30",44469,0,20,null,0,null,0,"2021-09-30",{"$f":"LOOKUP(I26,KURLAR!B21:B385,KURLAR!C21:C385)","v":8.8432999999999993},0]
["2021-09-30",44469,0,21,null,0,null,0,"2021-09-30",{"$f":"LOOKUP(I27,KURLAR!B22:B386,KURLAR!C22:C386)","v":8.8432999999999993},0]
["2021-09-30",44469,0,22,null,0,null,0,"2021-09-30",{"$f":"LOOKUP(I28,KURLAR!B23:B387,KURLAR!C23:C387)","v":8.8432999999999993},0]
["2021-09-30",44469,0,23,null,0,null,0,"2021-09-30",{"$f":"LOOKUP(I29,KURLAR!B24:B388,KURLAR!C24:C388)","v":8.8432999999999993},0]
["2021-09-30",44469,0,24,null,0,null,0,"2021-09-30",{"$f":"LOOKUP(I30,KURLAR!B25:B389,KURLAR!C25:C389)","v":8.8432999999999993},0]
["2021-09-30",44469,0,25,null,0,null,0,"2021-09-30",{"$f":"LOOKUP(I31,KURLAR!B26:B390,KURLAR!C26:C390)","v":8.8432999999999993},0]
["2021-09-30",44469,0,26,null,0,null,0,"2021-09-30",{"$f":"LOOKUP(I32,KURLAR!B27:B391,KURLAR!C27:C391)","v":8.8432999999999993},0]
["2021-09-30",44469,0,27,null,0,null,0,"2021-09-30",{"$f":"LOOKUP(I33,KURLAR!B28:B392,KURLAR!C28:C392)","v":8.8432999999999993},0]
["2021-09-30",44469,0,28,null,0,null,0,"2021-09-30",{"$f":"LOOKUP(I34,KURLAR!B29:B393,KURLAR!C29:C393)","v":8.8432999999999993},0]
["2021-09-30",44469,0,29,null,0,null,0,"2021-09-30",{"$f":"LOOKUP(I35,KURLAR!B30:B394,KURLAR!C30:C394)","v":8.8432999999999993},0]
["2021-09-30",44469,0,30,null,0,null,0,"2021-09-30",{"$f":"LOOKUP(I36,KURLAR!B31:B395,KURLAR!C31:C395)","v":8.8432999999999993},0]
["2021-09-30",{"$f":"A37","v":44469},{"$f":"E37","v":0},31,null,0,null,0,"2021-09-30",{"$f":"LOOKUP(I37,KURLAR!B32:B396,KURLAR!C32:C396)","v":8.8432999999999993},0]
["2021-09-30",44469,0,32,null,0,null,0,"2021-09-30",{"$f":"LOOKUP(I38,KURLAR!B33:B397,KURLAR!C33:C397)","v":8.8432999999999993},0]
["2021-09-30",44469,0,33,null,0,null,0,"2021-09-30",{"$f":"LOOKUP(I39,KURLAR!B34:B398,KURLAR!C34:C398)","v":8.8432999999999993},0]
["2021-09-30",44469,0,34,null,0,null,0,"2021-09-30",{"$f":"LOOKUP(I40,KURLAR!B35:B399,KURLAR!C35:C399)","v":8.8432999999999993},0]
{"$rows_left_out":168}
{"sheet":"AVRO","index":3,"n_rows":207,"n_cols":11,"rows_kept":207,"cut":false,"hidden":false,"merged":[[4,3,4,7],[4,8,4,10],[206,3,206,5]]}
[]
[null,null,null,null,null,null,"Değerlemede Dikkate Alınacak Kur",null,"Kur Korumalı Mevduat Hesabına Aktarılacak Tutar","İstisnadan Yararlanma Oranı","İstisnadan Yararlanabilecek Kazanç Tutarı"]
[null,null,null,null,"DÖVİZ TEVDİAT HESABINDA \n31/12/2021 TARİHİ İTİBARİYLE YER ALAN DÖNEM SONU AVRO MİKTARI",null,{"$f":"KURLAR!D366","v":14.6823},null,null,{"$f":"I3/F3","v":{"$error":"#DIV/0!"}},{"$f":"K207*J3","v":{"$error":"#DIV/0!"}}]
[]
[null,null,null,"EN SON ALIM YAPILAN DÖVİZLERİN ALIM TARİH VE MİKTAR DURUMU",null,null,null,null,"DEĞERLEME İŞLEMLERİ"]
[null,"30/09/2021 Tarihinin Sayı Değeri","Alım Tarihinin Sayı Değeri","SIRA NO","Alım Tarihi","Yazılabilecek Max Alım Miktarı","Alım Miktarı","Kalan Bir Önceki Max  Alım Miktarı","Değerlemede Dikkate Alınacak Tarih","Değerlemede Dikkate Alınacak Kur","Hesaplanan Kur Farkı Kazancı"]
["2021-09-30",{"$f":"A7","v":44469},{"$f":"E7","v":0},1,null,{"$f":"F3","v":0},null,{"$f":"F3-G7","v":0},{"$f":"IF(C7>=B7,E7,(A7))","v":"2021-09-30"},{"$f":"LOOKUP(I7,KURLAR!B2:B366,KURLAR!D2:D366)","v":10.313499999999999},{"$f":"G7*($G$3-J7)","v":0}]
["2021-09-30",{"$f":"A8","v":44469},0,2,null,{"$f":"F7-G7","v":0},null,{"$f":"H7-G8","v":0},{"$f":"IF(C8>=B8,E8,(A8))","v":"2021-09-30"},{"$f":"LOOKUP(I8,KURLAR!B3:B367,KURLAR!D3:D367)","v":10.313499999999999},{"$f":"G8*($G$3-J8)","v":0}]
["2021-09-30",44469,0,3,null,{"$f":"F8-G8","v":0},null,{"$f":"H8-G9","v":0},"2021-09-30",{"$f":"LOOKUP(I9,KURLAR!B4:B368,KURLAR!D4:D368)","v":10.313499999999999},0]
["2021-09-30",44469,0,4,null,0,null,0,"2021-09-30",{"$f":"LOOKUP(I10,KURLAR!B5:B369,KURLAR!D5:D369)","v":10.313499999999999},0]
["2021-09-30",44469,0,5,null,0,null,0,"2021-09-30",{"$f":"LOOKUP(I11,KURLAR!B6:B370,KURLAR!D6:D370)","v":10.313499999999999},0]
["2021-09-30",44469,0,6,null,0,null,0,"2021-09-30",{"$f":"LOOKUP(I12,KURLAR!B7:B371,KURLAR!D7:D371)","v":10.313499999999999},0]
["2021-09-30",44469,0,7,null,0,null,0,"2021-09-30",{"$f":"LOOKUP(I13,KURLAR!B8:B372,KURLAR!D8:D372)","v":10.313499999999999},0]
["2021-09-30",44469,0,8,null,0,null,0,"2021-09-30",{"$f":"LOOKUP(I14,KURLAR!B9:B373,KURLAR!D9:D373)","v":10.313499999999999},0]
["2021-09-30",44469,0,9,null,0,null,0,"2021-09-30",{"$f":"LOOKUP(I15,KURLAR!B10:B374,KURLAR!D10:D374)","v":10.313499999999999},0]
["2021-09-30",44469,0,10,null,0,null,0,"2021-09-30",{"$f":"LOOKUP(I16,KURLAR!B11:B375,KURLAR!D11:D375)","v":10.313499999999999},0]
["2021-09-30",44469,0,11,null,0,null,0,"2021-09-30",{"$f":"LOOKUP(I17,KURLAR!B12:B376,KURLAR!D12:D376)","v":10.313499999999999},0]
["2021-09-30",44469,0,12,null,0,null,0,"2021-09-30",{"$f":"LOOKUP(I18,KURLAR!B13:B377,KURLAR!D13:D377)","v":10.313499999999999},0]
["2021-09-30",44469,0,13,null,0,null,0,"2021-09-30",{"$f":"LOOKUP(I19,KURLAR!B14:B378,KURLAR!D14:D378)","v":10.313499999999999},0]
["2021-09-30",44469,0,14,null,0,null,0,"2021-09-30",{"$f":"LOOKUP(I20,KURLAR!B15:B379,KURLAR!D15:D379)","v":10.313499999999999},0]
["2021-09-30",44469,0,15,null,0,null,0,"2021-09-30",{"$f":"LOOKUP(I21,KURLAR!B16:B380,KURLAR!D16:D380)","v":10.313499999999999},0]
["2021-09-30",44469,0,16,null,0,null,0,"2021-09-30",{"$f":"LOOKUP(I22,KURLAR!B17:B381,KURLAR!D17:D381)","v":10.313499999999999},0]
["2021-09-30",44469,0,17,null,0,null,0,"2021-09-30",{"$f":"LOOKUP(I23,KURLAR!B18:B382,KURLAR!D18:D382)","v":10.313499999999999},0]
["2021-09-30",44469,0,18,null,0,null,0,"2021-09-30",{"$f":"LOOKUP(I24,KURLAR!B19:B383,KURLAR!D19:D383)","v":10.313499999999999},0]
["2021-09-30",44469,0,19,null,0,null,0,"2021-09-30",{"$f":"LOOKUP(I25,KURLAR!B20:B384,KURLAR!D20:D384)","v":10.313499999999999},0]
["2021-09-30",44469,0,20,null,0,null,0,"2021-09-30",{"$f":"LOOKUP(I26,KURLAR!B21:B385,KURLAR!D21:D385)","v":10.313499999999999},0]
["2021-09-30",44469,0,21,null,0,null,0,"2021-09-30",{"$f":"LOOKUP(I27,KURLAR!B22:B386,KURLAR!D22:D386)","v":10.313499999999999},0]
["2021-09-30",44469,0,22,null,0,null,0,"2021-09-30",{"$f":"LOOKUP(I28,KURLAR!B23:B387,KURLAR!D23:D387)","v":10.313499999999999},0]
["2021-09-30",44469,0,23,null,0,null,0,"2021-09-30",{"$f":"LOOKUP(I29,KURLAR!B24:B388,KURLAR!D24:D388)","v":10.313499999999999},0]
["2021-09-30",44469,0,24,null,0,null,0,"2021-09-30",{"$f":"LOOKUP(I30,KURLAR!B25:B389,KURLAR!D25:D389)","v":10.313499999999999},0]
["2021-09-30",44469,0,25,null,0,null,0,"2021-09-30",{"$f":"LOOKUP(I31,KURLAR!B26:B390,KURLAR!D26:D390)","v":10.313499999999999},0]
["2021-09-30",44469,0,26,null,0,null,0,"2021-09-30",{"$f":"LOOKUP(I32,KURLAR!B27:B391,KURLAR!D27:D391)","v":10.313499999999999},0]
["2021-09-30",44469,0,27,null,0,null,0,"2021-09-30",{"$f":"LOOKUP(I33,KURLAR!B28:B392,KURLAR!D28:D392)","v":10.313499999999999},0]
["2021-09-30",44469,0,28,null,0,null,0,"2021-09-30",{"$f":"LOOKUP(I34,KURLAR!B29:B393,KURLAR!D29:D393)","v":10.313499999999999},0]
["2021-09-30",44469,0,29,null,0,null,0,"2021-09-30",{"$f":"LOOKUP(I35,KURLAR!B30:B394,KURLAR!D30:D394)","v":10.313499999999999},0]
["2021-09-30",44469,0,30,null,0,null,0,"2021-09-30",{"$f":"LOOKUP(I36,KURLAR!B31:B395,KURLAR!D31:D395)","v":10.313499999999999},0]
["2021-09-30",44469,0,31,null,0,null,0,"2021-09-30",{"$f":"LOOKUP(I37,KURLAR!B32:B396,KURLAR!D32:D396)","v":10.313499999999999},0]
["2021-09-30",44469,0,32,null,0,null,0,"2021-09-30",{"$f":"LOOKUP(I38,KURLAR!B33:B397,KURLAR!D33:D397)","v":10.313499999999999},0]
["2021-09-30",44469,0,33,null,0,null,0,"2021-09-30",{"$f":"LOOKUP(I39,KURLAR!B34:B398,KURLAR!D34:D398)","v":10.313499999999999},0]
["2021-09-30",44469,0,34,null,0,null,0,"2021-09-30",{"$f":"LOOKUP(I40,KURLAR!B35:B399,KURLAR!D35:D399)","v":10.313499999999999},0]
{"$rows_left_out":168}
{"sheet":"İNGİLİZ STERLİNİ","index":4,"n_rows":207,"n_cols":11,"rows_kept":207,"cut":false,"hidden":false,"merged":[[4,3,4,7],[4,8,4,10],[206,3,206,5]]}
[]
[null,null,null,null,null,null,"Değerlemede Dikkate Alınacak Kur",null,"Kur Korumalı Mevduat Hesabına Aktarılacak Tutar","İstisnadan Yararlanma Oranı","İstisnadan Yararlanabilecek Kazanç Tutarı"]
[null,null,null,null,"DÖVİZ TEVDİAT HESABINDA \n31/12/2021 TARİHİ İTİBARİYLE YER ALAN DÖNEM SONU İNGİLİZ STERLİNİ MİKTARI",null,{"$f":"KURLAR!E366","v":17.452999999999999},null,null,{"$f":"I3/F3","v":{"$error":"#DIV/0!"}},{"$f":"K207*J3","v":{"$error":"#DIV/0!"}}]
[]
[null,null,null,"EN SON ALIM YAPILAN DÖVİZLERİN ALIM TARİH VE MİKTAR DURUMU",null,null,null,null,"DEĞERLEME İŞLEMLERİ"]
[null,"30/09/2021 Tarihinin Sayı Değeri","Alım Tarihinin Sayı Değeri","SIRA NO","Alım Tarihi","Yazılabilecek Max Alım Miktarı","Alım Miktarı","Kalan Bir Önceki Max  Alım Miktarı","Değerlemede Dikkate Alınacak Tarih","Değerlemede Dikkate Alınacak Kur","Hesaplanan Kur Farkı Kazancı"]
["2021-09-30",{"$f":"A7","v":44469},{"$f":"E7","v":0},1,null,{"$f":"F3","v":0},null,{"$f":"F3-G7","v":0},{"$f":"IF(C7>=B7,E7,(A7))","v":"2021-09-30"},{"$f":"LOOKUP(I7,KURLAR!B2:B366,KURLAR!E2:E366)","v":11.9292},{"$f":"G7*($G$3-J7)","v":0}]
["2021-09-30",{"$f":"A8","v":44469},0,2,null,{"$f":"F7-G7","v":0},null,{"$f":"H7-G8","v":0},{"$f":"IF(C8>=B8,E8,(A8))","v":"2021-09-30"},{"$f":"LOOKUP(I8,KURLAR!B3:B367,KURLAR!E3:E367)","v":11.9292},{"$f":"G8*($G$3-J8)","v":0}]
["2021-09-30",44469,0,3,null,{"$f":"F8-G8","v":0},null,{"$f":"H8-G9","v":0},"2021-09-30",{"$f":"LOOKUP(I9,KURLAR!B4:B368,KURLAR!E4:E368)","v":11.9292},0]
["2021-09-30",44469,0,4,null,0,null,0,"2021-09-30",{"$f":"LOOKUP(I10,KURLAR!B5:B369,KURLAR!E5:E369)","v":11.9292},0]
["2021-09-30",44469,0,5,null,0,null,0,"2021-09-30",{"$f":"LOOKUP(I11,KURLAR!B6:B370,KURLAR!E6:E370)","v":11.9292},0]
["2021-09-30",44469,0,6,null,0,null,0,"2021-09-30",{"$f":"LOOKUP(I12,KURLAR!B7:B371,KURLAR!E7:E371)","v":11.9292},0]
["2021-09-30",44469,0,7,null,0,null,0,"2021-09-30",{"$f":"LOOKUP(I13,KURLAR!B8:B372,KURLAR!E8:E372)","v":11.9292},0]
["2021-09-30",44469,0,8,null,0,null,0,"2021-09-30",{"$f":"LOOKUP(I14,KURLAR!B9:B373,KURLAR!E9:E373)","v":11.9292},0]
["2021-09-30",44469,0,9,null,0,null,0,"2021-09-30",{"$f":"LOOKUP(I15,KURLAR!B10:B374,KURLAR!E10:E374)","v":11.9292},0]
["2021-09-30",44469,0,10,null,0,null,0,"2021-09-30",{"$f":"LOOKUP(I16,KURLAR!B11:B375,KURLAR!E11:E375)","v":11.9292},0]
["2021-09-30",44469,0,11,null,0,null,0,"2021-09-30",{"$f":"LOOKUP(I17,KURLAR!B12:B376,KURLAR!E12:E376)","v":11.9292},0]
["2021-09-30",44469,0,12,null,0,null,0,"2021-09-30",{"$f":"LOOKUP(I18,KURLAR!B13:B377,KURLAR!E13:E377)","v":11.9292},0]
["2021-09-30",44469,0,13,null,0,null,0,"2021-09-30",{"$f":"LOOKUP(I19,KURLAR!B14:B378,KURLAR!E14:E378)","v":11.9292},0]
["2021-09-30",44469,0,14,null,0,null,0,"2021-09-30",{"$f":"LOOKUP(I20,KURLAR!B15:B379,KURLAR!E15:E379)","v":11.9292},0]
["2021-09-30",44469,0,15,null,0,null,0,"2021-09-30",{"$f":"LOOKUP(I21,KURLAR!B16:B380,KURLAR!E16:E380)","v":11.9292},0]
["2021-09-30",44469,0,16,null,0,null,0,"2021-09-30",{"$f":"LOOKUP(I22,KURLAR!B17:B381,KURLAR!E17:E381)","v":11.9292},0]
["2021-09-30",44469,0,17,null,0,null,0,"2021-09-30",{"$f":"LOOKUP(I23,KURLAR!B18:B382,KURLAR!E18:E382)","v":11.9292},0]
["2021-09-30",44469,0,18,null,0,null,0,"2021-09-30",{"$f":"LOOKUP(I24,KURLAR!B19:B383,KURLAR!E19:E383)","v":11.9292},0]
["2021-09-30",44469,0,19,null,0,null,0,"2021-09-30",{"$f":"LOOKUP(I25,KURLAR!B20:B384,KURLAR!E20:E384)","v":11.9292},0]
["2021-09-30",44469,0,20,null,0,null,0,"2021-09-30",{"$f":"LOOKUP(I26,KURLAR!B21:B385,KURLAR!E21:E385)","v":11.9292},0]
["2021-09-30",44469,0,21,null,0,null,0,"2021-09-30",{"$f":"LOOKUP(I27,KURLAR!B22:B386,KURLAR!E22:E386)","v":11.9292},0]
["2021-09-30",44469,0,22,null,0,null,0,"2021-09-30",{"$f":"LOOKUP(I28,KURLAR!B23:B387,KURLAR!E23:E387)","v":11.9292},0]
["2021-09-30",44469,0,23,null,0,null,0,"2021-09-30",{"$f":"LOOKUP(I29,KURLAR!B24:B388,KURLAR!E24:E388)","v":11.9292},0]
["2021-09-30",44469,0,24,null,0,null,0,"2021-09-30",{"$f":"LOOKUP(I30,KURLAR!B25:B389,KURLAR!E25:E389)","v":11.9292},0]
["2021-09-30",44469,0,25,null,0,null,0,"2021-09-30",{"$f":"LOOKUP(I31,KURLAR!B26:B390,KURLAR!E26:E390)","v":11.9292},0]
["2021-09-30",44469,0,26,null,0,null,0,"2021-09-30",{"$f":"LOOKUP(I32,KURLAR!B27:B391,KURLAR!E27:E391)","v":11.9292},0]
["2021-09-30",44469,0,27,null,0,null,0,"2021-09-30",{"$f":"LOOKUP(I33,KURLAR!B28:B392,KURLAR!E28:E392)","v":11.9292},0]
["2021-09-30",44469,0,28,null,0,null,0,"2021-09-30",{"$f":"LOOKUP(I34,KURLAR!B29:B393,KURLAR!E29:E393)","v":11.9292},0]
["2021-09-30",44469,0,29,null,0,null,0,"2021-09-30",{"$f":"LOOKUP(I35,KURLAR!B30:B394,KURLAR!E30:E394)","v":11.9292},0]
["2021-09-30",44469,0,30,null,0,null,0,"2021-09-30",{"$f":"LOOKUP(I36,KURLAR!B31:B395,KURLAR!E31:E395)","v":11.9292},0]
["2021-09-30",44469,0,31,null,0,null,0,"2021-09-30",{"$f":"LOOKUP(I37,KURLAR!B32:B396,KURLAR!E32:E396)","v":11.9292},0]
["2021-09-30",44469,0,32,null,0,null,0,"2021-09-30",{"$f":"LOOKUP(I38,KURLAR!B33:B397,KURLAR!E33:E397)","v":11.9292},0]
["2021-09-30",44469,0,33,null,0,null,0,"2021-09-30",{"$f":"LOOKUP(I39,KURLAR!B34:B398,KURLAR!E34:E398)","v":11.9292},0]
["2021-09-30",44469,0,34,null,0,null,0,"2021-09-30",{"$f":"LOOKUP(I40,KURLAR!B35:B399,KURLAR!E35:E399)","v":11.9292},0]
{"$rows_left_out":168}
{"sheet":"KURLAR","index":5,"n_rows":366,"n_cols":5,"rows_kept":366,"cut":false,"hidden":false,"merged":[]}
["Tarihin Sayı Değeri","TARİH","USD ALIŞ","AVRO ALIŞ","İNGİLİZ STERLİNİ ALIŞ"]
[{"$f":"B2","v":44197},"2021-01-01",7.4194000000000004,9.1164000000000005,10.1142]
[{"$f":"B3","v":44198},"2021-01-02",7.4194000000000004,9.1164000000000005,10.1142]
[44199,"2021-01-03",7.4194000000000004,9.1164000000000005,10.1142]
[44200,"2021-01-04",7.4194000000000004,9.1164000000000005,10.1142]
[44201,"2021-01-05",7.3601999999999999,9.0381999999999998,10.054399999999999]
[44202,"2021-01-06",7.3865999999999996,9.0655999999999999,10.014799999999999]
[44203,"2021-01-07",7.33,9.0396999999999998,9.9842999999999993]
[44204,"2021-01-08",7.2732999999999999,8.9342000000000006,9.8641000000000005]
[44205,"2021-01-09",7.3490000000000002,8.9968000000000004,9.9666999999999994]
[44206,"2021-01-10",7.3490000000000002,8.9968000000000004,9.9666999999999994]
[44207,"2021-01-11",7.3490000000000002,8.9968000000000004,9.9666999999999994]
[44208,"2021-01-12",7.4431000000000003,9.0629000000000008,10.029]
[44209,"2021-01-13",7.4607999999999999,9.0693000000000001,10.1082]
[44210,"2021-01-14",7.4284999999999997,9.0551999999999992,10.144]
[44211,"2021-01-15",7.3884999999999996,8.9815000000000005,10.068899999999999]
[44212,"2021-01-16",7.3876999999999997,8.9634999999999998,10.0685]
[44213,"2021-01-17",7.3876999999999997,8.9634999999999998,10.0685]
[44214,"2021-01-18",7.3876999999999997,8.9634999999999998,10.0685]
[44215,"2021-01-19",7.4951999999999996,9.0457000000000001,10.1348]
[44216,"2021-01-20",7.4485000000000001,9.0235000000000003,10.119400000000001]
[44217,"2021-01-21",7.4367000000000001,9.0231999999999992,10.155900000000001]
[44218,"2021-01-22",7.3836000000000004,8.9596999999999998,10.1128]
[44219,"2021-01-23",7.3985000000000003,9.0044000000000004,10.1006]
[44220,"2021-01-24",7.3985000000000003,9.0044000000000004,10.1006]
[44221,"2021-01-25",7.3985000000000003,9.0044000000000004,10.1006]
[44222,"2021-01-26",7.3796999999999997,8.9778000000000002,10.092599999999999]
[44223,"2021-01-27",7.3834999999999997,8.9550000000000001,10.0587]
[44224,"2021-01-28",7.3544,8.9276,10.0854]
[44225,"2021-01-29",7.3723000000000001,8.9215999999999998,10.0504]
[44226,"2021-01-30",7.3216000000000001,8.8718000000000004,10.01]
[44227,"2021-01-31",7.3216000000000001,8.8718000000000004,10.01]
[44228,"2021-02-01",7.3216000000000001,8.8718000000000004,10.01]
[44229,"2021-02-02",7.2184999999999997,8.7345000000000006,9.8916000000000004]
[44230,"2021-02-03",7.1372,8.6069999999999993,9.7487999999999992]
[44231,"2021-02-04",7.1497999999999999,8.5995000000000008,9.7423000000000002]
[44232,"2021-02-05",7.1323999999999996,8.5558999999999994,9.6717999999999993]
[44233,"2021-02-06",7.0789,8.4763999999999999,9.6735000000000007]
[44234,"2021-02-07",7.0789,8.4763999999999999,9.6735000000000007]
[44235,"2021-02-08",7.0789,8.4763999999999999,9.6735000000000007]
{"$rows_left_out":326}