{"text_format":"1","workbook":"xlsx","n_sheets":18,"sheets":["ŞABLON (32 6 BİST İNDİRİMSİ (2)","ŞABLON (32 6 BİST İNDİRİMSİZ)","BİST (32 6 İNDİRİMLİ)","İ Ö 2","İ Ö 3","İ Ö 4","İ Ö 5","Ü Ö1","Ü Ö2","İÜ Ö1","İÜ Ö2","İÜ Ö3","İÜ Ö4","32-1-2-8 Ö","32-1-2-9-1 Ö","32-1-2-9-2 Ö","32-1-2-10 Ö","32-1-1-11 Ö"],"not_rendered":{"charts":0,"images":0,"macros":1,"external_links":0,"defined_names":0,"comments":0,"pivot_tables":0},"unopened":[],"bounds":{"document_bytes":16777216,"sheet_cells":100000,"rows_first":2000,"rows_last":500,"rows_between":2000,"halvings":0,"cell_chars":16384,"cell_head_chars":4096},"cells_cut":0,"cells_raw":0,"read":"whole","date_system":"1900"}

{"sheet":"ŞABLON (32 6 BİST İNDİRİMSİ (2)","index":0,"n_rows":149,"n_cols":12,"rows_kept":149,"cut":false,"hidden":true,"merged":[[84,2,84,6],[1,1,2,1],[59,1,59,2],[60,1,60,2],[71,1,72,1],[73,1,73,2],[74,1,74,2],[74,3,74,4],[75,1,75,2],[75,3,75,4],[79,1,79,3],[82,2,82,6],[85,2,85,6],[87,1,89,1],[87,2,88,2],[87,3,88,3],[87,4,88,4],[87,5,88,5],[135,1,135,4],[137,1,138,2],[104,11,107,11],[109,11,112,11],[114,11,117,11],[119,11,122,11],[124,11,127,11],[128,7,133,8],[129,11,132,11]]}
[]
[null,"FAALİYET TÜRLERİ İTİBARİYLE HASILATLAR VE TOPLAM İÇİNDEKİ ORANLARI",{"$f":"IFERROR(C4/C4,0)","v":1},{"$f":"IFERROR(D4/C4,0)","v":0.20291429800601612},{"$f":"IFERROR(E4/C4,0)","v":1.4092120792888347},{"$f":"IFERROR(F4/C4,0)","v":-0.61212637729485087}]
[null,null,"Toplam Hasılat","İhracat faaliyeti","İmalat faaliyeti","Diğer faaliyetler"]
[null,"A-BRÜT SATIŞLAR (60)",{"$f":"D4+E4+F4","v":32870601.360000003},{"$f":"SUM(D5:D7)","v":6669915},{"$f":"SUM(E5:E7)","v":46321648.490000002},-20120962.129999999]
[null,"1-Yurtiçi Satışlar (600)",{"$f":"D5+E5+F5","v":46321648.490000002},null,46321648.490000002]
[null,"2-Yurtdışı Satışlar (601)",{"$f":"D6+E6+F6","v":6669915},6669915]
[null,"3-Diğer Gelirler (602)",{"$f":"D7+E7+F7","v":-20120962.129999999},null,null,-20120962.129999999]
[null,"B-SATIŞ İNDİRİMLERİ(-) (61)",{"$f":"SUM(C9:C11)","v":0},{"$f":"SUM(D9:D11)","v":0},{"$f":"SUM(E9:E11)","v":0},0]
[null,"1-Satıştan İadeler (-) (610)",{"$f":"SUM(D9:F9)","v":0}]
[null,"2- Satış İskontoları (-) (611)",{"$f":"SUM(D10:F10)","v":0}]
[null,"3-Diğer İndirimler (-) (612)",0]
[null,"C-NET SATIŞLAR",{"$f":"C4-C8","v":32870601.360000003},{"$f":"D4-D8","v":6669915},{"$f":"E4-E8","v":46321648.490000002},-20120962.129999999]
[null,"D-SATIŞLARIN MALİYETİ (-) (62)",{"$f":"SUM(C14:C17)","v":0},{"$f":"SUM(D14:D17)","v":0},{"$f":"SUM(E14:E17)","v":0},{"$f":"SUM(F14:F17)","v":0}]
[null,"1-Satılan Mamuller Maliyeti ( 620)",{"$f":"SUM(D14:F14)","v":0}]
[null,"2-Satılan Ticari Mal Maliyeti (621)",{"$f":"SUM(D15:F15)","v":0}]
[null,"3-Satılan Hizmet Maliyeti (622)",0]
[null,"4-Diğer Satışların Maliyeti (623)",0]
[null,"BRÜT SATIŞ KARI / ZARARI",{"$f":"C12-C13","v":32870601.360000003},{"$f":"D12-D13","v":6669915},{"$f":"E12-E13","v":46321648.490000002},-20120962.129999999]
[null,"E-FAALİYET GİDERLERİ (-) (63)",{"$f":"SUM(C20:C24)","v":0},{"$f":"SUM(D20:D24)","v":0},{"$f":"SUM(E20:E24)","v":0},0]
[null,"1-Araştırma ve Geliştirme Giderleri(-) (630)",{"$f":"SUM(D20:F20)","v":0}]
[null,"2-Pazarlama, Satış ve Dağıtım Giderleri(-) (631)",{"$f":"SUM(D21:F21)","v":0}]
[null,"3-Genel Yönetim Giderleri(-) (632)",{"$f":"SUM(D22:F22)","v":0}]
[null,"MÜŞTEREK GENEL GİDERLER (DAĞITIM-HASILAT PAYINA GÖRE)",null,{"$f":"C23*D2","v":0},{"$f":"C23*E2","v":0},{"$f":"C23*F2","v":0}]
[null,"MÜŞTEREK GENEL GİDER GİBİ DAĞITIMA TABİ TUTULACAK AMORTİSMAN GİDERLERİ  (DAĞITIM-HASILAT PAYINA GÖRE)",null,{"$f":"C24*D2","v":0},{"$f":"C24*E2","v":0},{"$f":"C24*F2","v":0}]
[null,"FAALİYET KARI / ZARARI ",{"$f":"C18-C19","v":32870601.360000003},{"$f":"D18-D19","v":6669915},{"$f":"E18-E19","v":46321648.490000002},-20120962.129999999]
[null,"F-DİĞER FAALİYETLERDEN OLAĞAN GELİR VE KARLAR (64)",{"$f":"SUM(C27:C35)","v":0},{"$f":"SUM(D27:D35)","v":0},{"$f":"SUM(E27:E35)","v":0},{"$f":"SUM(F27:F35)","v":0}]
[null,"         1- İŞTİRAKLERDEN TEMETTÜ GELİRLERİ (640)",{"$f":"SUM(D27:F27)","v":0}]
[null,"         2- BAĞLI ORTAKLIKLARDAN TEMETTÜ GELİRLERİ (641)",{"$f":"SUM(D28:F28)","v":0}]
[null,"         3- FAİZ GELİRLERİ (642) (ihracat ve imalat kaynaklı alacağın tahsiline kadar olan süreçte oluşan)",0]
[null,"         4- KOMİSYON GELİRLERİ (643)",0]
[null,"         5- KONUSU OLMAYAN KARŞILIKLAR (644)",0]
[null,"         6- MENKUL KIYMET SATIŞ KARLARI (645)",0]
[null,"         7- KAMBİYO KARLARI (646) (ihracat ve imalat kaynaklı alacağın tahsiline kadar olan süreçte oluşan)",0]
[null,"         8- REESKONT FAİZ GELİRLERİ (647)",0]
[null,"         9- FAALİYETLE İLGİLİ DİĞER GELİR VE KARLAR (649)",0]
[null,"ARA TOPLAM",{"$f":"C25+C26","v":32870601.360000003},{"$f":"D25+D26","v":6669915},{"$f":"E25+E26","v":46321648.490000002},{"$f":"F25+F26","v":-20120962.129999999}]
[null,"G-DİĞER FAALİYETLERDEN OLAĞAN GİDER VE ZARARLAR(-) (65)",{"$f":"SUM(C38:C43)","v":0},{"$f":"SUM(D38:D43)","v":0},{"$f":"SUM(E38:E43)","v":0},0]
[null,"         1- KOMİSYON GİDERLERİ (653)",{"$f":"SUM(D38:F38)","v":0}]
[null,"         2- KARŞILIK GİDERLERİ (654)",{"$f":"SUM(D39:F39)","v":0}]
[null,"         3- MENKUL KIYMET SATIŞ ZARARLARI (655)",0]
[null,"         4- KAMBİYO ZARARLARI (656) (ihracat ve imalat kaynaklı alacağın tahsiline kadar olan süreçte oluşan)",0]
[null,"         5- REESKONT FAİZ GİDERLERİ (657)",0]
[null,"         6- DİĞER OLAĞAN GİDER VE ZARARLAR (659)",{"$f":"SUM(D43:F43)","v":0}]
[null,"ARA TOPLAM",{"$f":"C36-C37","v":32870601.360000003},{"$f":"D36-D37","v":6669915},{"$f":"E36-E37","v":46321648.490000002},-20120962.129999999]
[null,"H-FİNANSMAN GİDERLERİ(-) (66)",{"$f":"SUM(C46:C49)","v":0},{"$f":"SUM(D46:D49)","v":0},{"$f":"SUM(E46:E49)","v":0},{"$f":"SUM(F46:F49)","v":0}]
[null,"         1- KISA VADELİ BORÇLANMA GİDERLERİ (-)",{"$f":"SUM(D46:F46)","v":0}]
[null,"         2- UZUN VADELİ BORÇLANMA GİDERLERİ (-)",{"$f":"SUM(D47:F47)","v":0}]
[null,"         1- KISA VADELİ BORÇLANMA GİDERLERİ (-) (DAĞITIM)",null,{"$f":"C48*D2","v":0},{"$f":"C48*E2","v":0},{"$f":"C48*F2","v":0}]
[null,"         2- UZUN VADELİ BORÇLANMA GİDERLERİ (-) (DAĞITIM)",null,{"$f":"C49*D2","v":0},{"$f":"C49*E2","v":0},{"$f":"C49*F2","v":0}]
[null,"ARA TOPLAM",{"$f":"C44-C45","v":32870601.360000003},{"$f":"D44-D45","v":6669915},{"$f":"E44-E45","v":46321648.490000002},{"$f":"F44-F45","v":-20120962.129999999}]
[null,"I-OLAĞANDIŞI GELİR VE KÂRLAR (67)",{"$f":"SUM(D51:F51)","v":0},{"$f":"SUM(D52:D53)","v":0},{"$f":"SUM(E52:E53)","v":0},{"$f":"SUM(F52:F53)","v":0}]
[null,"1- ÖNCEKİ DÖNEM GELİR VE KARLARI (671)",{"$f":"SUM(D52:F52)","v":0}]
[null,"2-DİĞER OLAĞAN DIŞI GELİR VE KARLAR (679)",{"$f":"SUM(D53:F53)","v":0}]
[null,"ARA TOPLAM",{"$f":"SUM(D54:F54)","v":32870601.360000003},{"$f":"D50+D51","v":6669915},{"$f":"E50+E51","v":46321648.490000002},-20120962.129999999]
[null,"J-OLAĞANDIŞI GİDER VE ZARARLAR(-) (68)",{"$f":"SUM(C56:C58)","v":0},{"$f":"SUM(D56:D58)","v":0},{"$f":"SUM(E56:E58)","v":0},0]
[null,"1-Çalışmayan Kısım Gider ve Zararları(-) (680)",{"$f":"SUM(D56:F56)","v":0}]
[null,"2-Önceki Dönem Gider ve Zararları(-) (681)",{"$f":"SUM(D57:F57)","v":0}]
[null,"3-Diğer Olağan Dışı Gider ve Zararlar(-) (689)",0]
[null,"DÖNEM KÂRI VEYA ZARARI \n(TİCARİ BİLANÇO KARI ZARARI )",{"$f":"C54-C55","v":32870601.360000003},{"$f":"D54-D55","v":6669915},{"$f":"E54-E55","v":46321648.490000002},-20120962.129999999]
[null,"İHRACAT, İMALAT VE DİĞER FAALİYETLERDEN ELDE EDİLEN KAZANCIN TOPLAM TİCARİ KAZANÇ İÇİNDEKİ PAYLARI  \n\n(Kazançlar arasında Öncelik İhracat Kazancına Verilmiştir. İhrcat Kazancından arta kalan Ticari Kazanç İmalat ve Diğer Faaliyetlere Sayılmıştır.)\n\n",null,{"$f":"IF(D59>=$C$59,1,\n    IF(D59<=0,0,\n    IF(AND(D59>0,D59<$C$59),D59/$C$59)))","v":0.20291429800601612},{"$f":"IF(E59>=$C$59,1,\n    IF(E59<=0,0,\n    IF(AND(E59>0,E59<$C$59),E59/$C$59)))","v":1},{"$f":"IF(F59>=$C$59,1,\n    IF(F59<=0,0,\n    IF(AND(F59>0,F59<$C$59),F59/$C$59)))","v":0}]
[null,null,null,{"$f":"D60/(D60+E60+F60)","v":0.16868558162653188},{"$f":"E60/(D60+E60+F60)","v":0.83131441837346809},{"$f":"F60/(D60+E60+F60)","v":0}]
[]
[null,"KKEG +",16204572.359999999]
[null," KABUL EDİLMEYEN GELİRLER -"]
[null,"ZARAR OLSA DAHİ İNDİRİLECEK İSTİSNALAR -",{"$f":"C66+C67+C68","v":0}]
[null,"Hizmet İhracatı Faaliyetinden (KVK 10-1/ğ) Elde Edilen Kazançlardan İstisna Edilenlerin Toplamı"]
[null,"İmalat Faaliyetinden Elde Edilen Kazançlardan İstisna Edilenlerin Toplamı"]
[null,"Diğer Faaliyetlerden Elde Edilen Kazançlardan İstisna Edilenlerin Toplamı"]
[null,"GEÇMİŞ YIL ZARARLARI -"]
[null,"İNDİRİMLER -",null,"AZAMİ YAZILABİLECEK İNDİRİMLER TUTARI",{"$f":"C59+C63-C64-C65-C69","v":49075173.719999999}]
[]
[null,"1 PUAN İNDİRİM UYGULANACAK TUTARIN HESABINDA İSTİSNA KAZANÇLAR DÜŞÜLDÜKTEN SONRA BULUNAN TİCARİ KAZANÇ TUTARI İLE  İHRACAT,İMALAT VE DİĞER KAZANÇLARIN TUTARI","TİCARİ KAZANÇ TAN İhracat ve İmalat Kazancından İstisna Olan Tutarlar Düşüldükten Sonra Kalan Tutarı","İhracat Faaliyetinden Elde Edilen  Kazançtan İstisna Olan Kısım Düşüldükten Sonra Bulunan Tutarı","Üretim  Faaliyetinden Elde Edilen  Kazançtan İstisna Olan Kısım Düşüldükten Sonra Bulunan Tutarı","Diğer Faaliyetinden Elde Edilen  Kazanç"]
[null,null,{"$f":"IF(C59-C66-C67<=0,0,C59-C66-C67)","v":32870601.360000003},{"$f":"IF($D$59-C66<=0,0,MIN($D$59-C66,$C$73*D61))","v":5544796.5088254707},{"$f":"IF($E$59-C67<=0,0,MIN($E$59-C67,$C$73*E61))","v":27325804.851174533},{"$f":"IF(C73-D73-E73<=0,0,C73-D73-E73)","v":0}]
[null,"MATRAH DAĞITIM PAYLARI",null,{"$f":"IFERROR(IF(D73/C73<=0,0,D73/C73),0)","v":0.16868558162653188},{"$f":"IFERROR(IF(E73/C73<=0,0,E73/C73),0)","v":0.83131441837346809},{"$f":"IFERROR(F73/C73,0)","v":0}]
[null,"İHRACAT, İMALAT VE DİĞER FAALİYETLERDEN ELDE EDİLEN KAZANCIN TOPLAM TİCARİ KAZANÇ İÇİNDEKİ PAYLARI ",null,{"$f":"IFERROR(IF(AND(D73+E73>C73, F73<=0),1,(D73+E73)/C73),0)","v":1},null,{"$f":"IFERROR(IF(F73<=0,0,F73/C73),0)","v":0}]
[null,"NEGATİF VE % 100 DEN BÜYÜKLÜK KONTROLÜ SONRASINDAKİ PAYLARI",null,{"$f":"IFERROR(IF(D75<=0,0,IF(D75>1,1,D75)),0)","v":1},null,{"$f":"IFERROR(IF(F75<=0,0,IF(F75>1,1,F75)),0)","v":0}]
[]
[null,"SAFİ KURUM KAZANCI \n(KURUMLAR VERGİSİ MATRAHI)",{"$f":"C59+C63-C64-C65-C69-C70","v":49075173.719999999},{"$f":"IF(C78<0, \"ZARAR\",\"KAR\")","v":"KAR"}]
[]
[null,"2022 YILI 3. DÖNEM İNDİRİMLİ KURUMLAR VERGİSİ HESAPLAMA TABLOSU"]
[null,null,"1. TEŞVİK BELGESİ","2. TEŞVİK BELGESİ","3. TEŞVİK BELGESİ","4. TEŞVİK BELGESİ","5. TEŞVİK BELGESİ"]
[null,"Vergi İndirim Oranı (VİO)"]
[null,"KV MATRAHI (Safi Kurum Kazancı)",{"$f":"C78","v":49075173.719999999}]
[null,"32/A  Uygulanacak K.V. Matrahı (HER BİR TEŞVİK BELGESİ KAPSAMINDA YARARLANILABİLECEK YATIRIMA KATKI TUTARININ MATRAHI BU HÜCRELERE YAZILMALIDIR)",null,null,null,null,null,{"$f":"IF(SUM(C84:G84)>C78,\"32/A İNDİRİMİ UYGULANACAK KAZANÇ, SAFİ KURUM KAZANCINDAN FAZLADIR\",SUM(C84:G84))","v":0}]
[null,"32/A UYGULANMAYACAK K.V.  Matrahı",{"$f":"IF(C83-(C84+D84+E84+F84+G84)<0,0,C83-(C84+D84+E84+F84+G84))","v":49075173.719999999}]
[null,"MATRAH TOPLAMI",{"$f":"IF((C84+D84+E84+F84+G84+C85)>C78,C78,(C84+D84+E84+F84+G84+C85))","v":49075173.719999999}]
[]
[null,"SAFİ KURUM KAZANCININ  KV VERGİ ORANLARI İTİBARİYLE DAĞILIMI ","TOPLAM SAFİ KAZANÇ","İhracat Kazancı Payı","Üretim Kazancı Payı","Diğer Faaliyet Kazancı Payı"]
[]
[null,null,{"$f":"C78","v":49075173.719999999},{"$f":"IF(AND(AND($D$59>0,($D$59+$E$59)>=$C$59,D59>=C66),$C$90>=MAX(D59,D73)),\n\nMIN(MAX(IF(D59<=C90,D59,IF(D73<=C90,D73)),$C$90*D74)),\n\nIF(OR(D59<=0,D73<=0),0,\n\nMIN( MAX(   MAX(   IF(D59<=C90,D59),  IF(D73<=C90,D73) ),    MIN($C$90*D74,D59,D73)),$C$90)))","v":8278274.2223812919},{"$f":"MIN( IF(AND(AND($E$59>0,($D$59+$E$59)>=$C$59,E59>=C67),$C$90>=MAX(E59,E73)),\n\nMIN(MAX(IF(E59<=C90,E59,IF(E73<=C90,E73)),$C$90*E74)),\n\nIF(OR(E59<=0,E73<=0),0,\n\nMIN( MAX(   MAX(   IF(E59<=C90,E59),  IF(E73<=C90,E73) ),    MIN($C$90*E74,E59,E73)),$C$90))),C90-D90)","v":40796899.497618705},{"$f":"C90-D90-E90","v":0}]
[null,"SAFİ KURUM KAZANCININ DAĞILIMI ORANSAL DAĞILIMI",{"$f":"C90","v":49075173.719999999},{"$f":"D90/C90","v":0.16868558162653188},{"$f":"E90/C90","v":0.83131441837346809},{"$f":"F90/C90","v":0}]
[null,"SAFİ KURUM KAZANCININ DAĞILIMI TUTARSAL",{"$f":"C91","v":49075173.719999999},{"$f":"D90","v":8278274.2223812919},{"$f":"E90","v":40796899.497618705},{"$f":"F90","v":0}]
[null,"SAFİ KURUM KAZANCI DAĞILIMI",{"$f":"C92","v":49075173.719999999},{"$f":"IFERROR(IF(D92/C92>=1,1,D92/C92),0)","v":0.16868558162653188},{"$f":"IFERROR(IF(E92/C92>=1,1,E92/C92),0)","v":0.83131441837346809},{"$f":"IFERROR(IF(F92/C92>=1,1,F92/C92),0)","v":0},null,"KV ORANI"]
[null,"1 PUAN VE 32/A İNDİRİMİ OLMASAYDI HESAPLANAN KV TUTARI",{"$f":"C93*$H$94","v":12268793.43},{"$f":"D92*$H$94","v":2069568.555595323},{"$f":"E92*$H$94","v":10199224.874404676},{"$f":"F92*$H$94","v":0},null,0.25]
[null,"32/ A UYGULANAN MATRAH",{"$f":"C84+D84+E84+F84+G84","v":0},{"$f":"D107+D112+D117+D122+D127","v":0},{"$f":"D106+D111+D116+D121+D126","v":0},{"$f":"D105+D110+D115+D120+D125","v":0}]
[null,"32/A UYGULANACAK MATRAH ÜZERİNDEN ÖDENECEK KV TUTARI",{"$f":"J108+J113+J118+J123+J128","v":0},{"$f":"J107+J112+J117+J122+J127","v":0},{"$f":"J106+J111+J116+J121+J126","v":0},{"$f":"J105+J110+J115+J120+J125","v":0}]
[null,"32/A UYGULANMAYAN MATRAH",{"$f":"IF(C85<=0,0,C85)","v":49075173.719999999},{"$f":"D132","v":8278274.2223812919},{"$f":"D131","v":40796899.497618705},{"$f":"D130","v":0}]
[null,"32/A UYGULANMAYAN MATRAH ÜZERİNDEN ÖDENECEK KV TUTARI",{"$f":"L130","v":11446910.723904748},{"$f":"J132","v":1655654.8444762584},{"$f":"J131","v":9791255.8794284891},{"$f":"J130","v":0}]
[null,"TOPLAM ÖDENECEK KV",{"$f":"C96+C98","v":11446910.723904748},{"$f":"J132+J107","v":1655654.8444762584},{"$f":"J131+J106","v":9791255.8794284891},{"$f":"J130+J105","v":0}]
[null,"TOPLAM AVANTAJ  (YARARLANILAN 1 PUAN İNDİRİMİ + 32/A İNDİRİMİ TUTARI )",{"$f":"C94-C99","v":821882.70609525219},{"$f":"D101+D102","v":413913.7111190646},{"$f":"E101+E102","v":407968.99497618707},{"$f":"F101+F102","v":0}]
[null,"YARARLANILAN 1 - 5 PUAN İNDİRİMİ TUTARI",{"$f":"F133+F128+F123+F118+F113+F108","v":821882.70609525172},{"$f":"F132+F107+F112+F117+F122+F127","v":413913.7111190646},{"$f":"F131+F106+F111+F116+F121+F126","v":407968.99497618707},{"$f":"F130+F105+F110+F115+F120+F125","v":0}]
[null,"YARLANILAN 32/A İNDİRİMİ TUTARI",{"$f":"K108+K113+K118+K123+K128+K133","v":0},{"$f":"K107+K112+K122+K127+K132","v":0},{"$f":"K106+K111+K116+K121+K126+K131","v":0},{"$f":"K105++K110+K115+K120+K125+K130","v":0}]
[]
[null,"32/A UYGULANABİLECEK MATRAH (1.TEŞVİK BELGESİ)",{"$f":"C84","v":0},"KV MATRAHI","1 - 5 PUAN İNDİRİM OLMASAYDI HESAPLANAN KV TUTARI","1 -5 Puan İndirim Tutarı","1 - 5 Puan İndirim Sonrasında Hesaplanan KV Tutarı","32/A İndirimi Olmasaydı Ödenecek KV Tutarı","1 -5 Puan İndirim ve 32/A VİO Uygulandıktan Sonra Tatbik Edilecek KV Oranı","1 -5 Puan İndirim ve 32/A İndirimi Uygulandıktan Sonra Ödenecek  KV Tutarı","Yararlanılan Yatırıma Katkı Tutarı\n(32/A İnd. KV Nedeniyle Vazgeçilen Vergi Tutarı)","Ödenecek KV Tutarı"]
[null,"GENEL ORANA TABİ KISIM (DİĞER FAALİYETLER)",{"$f":"F93","v":0},{"$f":"C104*C105","v":0},{"$f":"D105*$H$94","v":0},0,{"$f":"E105-F105","v":0},{"$f":"G105","v":0},{"$f":"($H$94)-(($H$94)*$C$82)","v":0.25},{"$f":"I105*D105","v":0},{"$f":"G105-J105","v":0},{"$f":"J108","v":0}]
[null,"1 PUAN İNDİRİMLİ ORANA TABİ KISIM  (İMALAT)",{"$f":"E93","v":0.83131441837346809},{"$f":"C104*C106","v":0},{"$f":"D106*$H$94","v":0},{"$f":"D106/100","v":0},{"$f":"E106-F106","v":0},{"$f":"G106","v":0},{"$f":"($H$94-0.01)-(($H$94-0.01)*$C$82)","v":0.24},{"$f":"I106*D106","v":0},{"$f":"G106-J106","v":0}]
[null,"5 PUAN İNDİRİMLİ ORANA TABİ KISIM  ( İHRACAT)",{"$f":"D93","v":0.16868558162653188},{"$f":"C104*C107","v":0},{"$f":"D107*$H$94","v":0},{"$f":"D107/20","v":0},{"$f":"E107-F107","v":0},0,{"$f":"($H$94-0.05)-(($H$94-0.05)*C82)","v":0.2},0,{"$f":"G107-J107","v":0}]
[null,"TOPLAM",{"$f":"SUM(C105:C107)","v":1},{"$f":"SUM(D105:D107)","v":0},0,{"$f":"SUM(F105:F107)","v":0},{"$f":"SUM(G105:G107)","v":0},{"$f":"SUM(H105:H107)","v":0},null,0,0]
[null,"32/A UYGULANABİLECEK MATRAH (2.TEŞVİK BELGESİ)",{"$f":"D84","v":0},"KV MATRAHI","1 - 5 PUAN İNDİRİM OLMASAYDI HESAPLANAN KV TUTARI","1 -5 Puan İndirim Tutarı","1 -5 Puan İndirim Sonrasında Hesaplanan KV Tutarı","32/A İndirimi Olmasaydı Ödenecek KV Tutarı","1 - 5 Puan İndirim ve 32/A VİO Uygulandıktan Sonra Tatbik Edilecek KV Oranı","1-5  Puan İndirim ve 32/A İndirimi Uygulandıktan Sonra Ödenecek  KV Tutarı","Yararlanılan Yatırıma Katkı Tutarı\n(32/A İnd. KV Nedeniyle Vazgeçilen Vergi Tutarı)","Ödenecek KV Tutarı"]
[null,"GENEL ORANA TABİ KISIM (DİĞER FAALİYETLER)",{"$f":"F93","v":0},{"$f":"C109*C110","v":0},{"$f":"D110*$H$94","v":0},0,{"$f":"E110-F110","v":0},{"$f":"G110","v":0},{"$f":"($H$94)-(($H$94)*D82)","v":0.25},{"$f":"I110*D110","v":0},{"$f":"G110-J110","v":0},{"$f":"J113","v":0}]
[null,"1 PUAN İNDİRİMLİ ORANA TABİ KISIM  (İMALAT)",{"$f":"E93","v":0.83131441837346809},{"$f":"C109*C111","v":0},{"$f":"D111*$H$94","v":0},{"$f":"D111/100","v":0},{"$f":"E111-F111","v":0},{"$f":"G111","v":0},{"$f":"($H$94-0.01)-(($H$94-0.01)*D82)","v":0.24},{"$f":"I111*D111","v":0},{"$f":"G111-J111","v":0}]
[null,"5 PUAN İNDİRİMLİ ORANA TABİ KISIM  ( İHRACAT)",{"$f":"D93","v":0.16868558162653188},{"$f":"C109*C112","v":0},{"$f":"D112*$H$94","v":0},{"$f":"D112/20","v":0},{"$f":"E112-F112","v":0},0,{"$f":"($H$94-0.05)-(($H$94-0.05)*D82)","v":0.2},0,{"$f":"G112-J112","v":0}]
[null,"TOPLAM",{"$f":"SUM(C110:C112)","v":1},0,0,{"$f":"SUM(F110:F112)","v":0},{"$f":"SUM(G110:G112)","v":0},{"$f":"SUM(H110:H112)","v":0},null,{"$f":"SUM(J110:J112)","v":0},0]
[null,"32/A UYGULANABİLECEK MATRAH (3.TEŞVİK BELGESİ)",{"$f":"E84","v":0},"KV MATRAHI","1 - 5 PUAN İNDİRİM OLMASAYDI HESAPLANAN KV TUTARI","1-5 Puan İndirim Tutarı","1 - 5 Puan İndirim Sonrasında Hesaplanan KV Tutarı","32/A İndirimi Olmasaydı Ödenecek KV Tutarı","1 - 5 Puan İndirim ve 32/A VİO Uygulandıktan Sonra Tatbik Edilecek KV Oranı","1 -5 Puan İndirim ve 32/A İndirimi Uygulandıktan Sonra Ödenecek  KV Tutarı","Yararlanılan Yatırıma Katkı Tutarı\n(32/A İnd. KV Nedeniyle Vazgeçilen Vergi Tutarı)","Ödenecek KV Tutarı"]
[null,"GENEL ORANA TABİ KISIM (DİĞER FAALİYETLER)",{"$f":"F93","v":0},{"$f":"C114*C115","v":0},{"$f":"D115*$H$94","v":0},0,{"$f":"E115-F115","v":0},{"$f":"G115","v":0},{"$f":"($H$94)-(($H$94)*E82)","v":0.25},{"$f":"I115*D115","v":0},{"$f":"G115-J115","v":0},{"$f":"J118","v":0}]
[null,"1 PUAN İNDİRİMLİ ORANA TABİ KISIM  (İMALAT)",{"$f":"E93","v":0.83131441837346809},{"$f":"C114*C116","v":0},{"$f":"D116*$H$94","v":0},{"$f":"D116/100","v":0},{"$f":"E116-F116","v":0},{"$f":"G116","v":0},{"$f":"($H$94-0.01)-(($H$94-0.01)*E82)","v":0.24},{"$f":"I116*D116","v":0},{"$f":"G116-J116","v":0}]
[null,"5 PUAN İNDİRİMLİ ORANA TABİ KISIM  ( İHRACAT)",{"$f":"D93","v":0.16868558162653188},{"$f":"C114*C117","v":0},{"$f":"D117*$H$94","v":0},{"$f":"D117/20","v":0},{"$f":"E117-F117","v":0},0,{"$f":"($H$94-0.05)-(($H$94-0.05)*E82)","v":0.2},0,{"$f":"G117-J117","v":0}]
[null,"TOPLAM",{"$f":"SUM(C115:C117)","v":1},0,0,{"$f":"SUM(F115:F117)","v":0},{"$f":"SUM(G115:G117)","v":0},{"$f":"SUM(H115:H117)","v":0},null,{"$f":"SUM(J115:J117)","v":0},0]
[null,"32/A UYGULANABİLECEK MATRAH (4. TEŞVİK BELGESİ)",{"$f":"F84","v":0},"KV MATRAHI","1 - 5 PUAN İNDİRİM OLMASAYDI HESAPLANAN KV TUTARI","1-5 Puan İndirim Tutarı","1 -5 Puan İndirim Sonrasında Hesaplanan KV Tutarı","32/A İndirimi Olmasaydı Ödenecek KV Tutarı","1- 5  Puan İndirim ve 32/A VİO Uygulandıktan Sonra Tatbik Edilecek KV Oranı","1-5 Puan İndirim ve 32/A İndirimi Uygulandıktan Sonra Ödenecek  KV Tutarı","Yararlanılan Yatırıma Katkı Tutarı\n(32/A İnd. KV Nedeniyle Vazgeçilen Vergi Tutarı)","Ödenecek KV Tutarı"]
[null,"GENEL ORANA TABİ KISIM (DİĞER FAALİYETLER)",{"$f":"F93","v":0},{"$f":"C119*C120","v":0},{"$f":"D120*$H$94","v":0},0,{"$f":"E120-F120","v":0},{"$f":"G120","v":0},{"$f":"($H$94)-(($H$94)*F82)","v":0.25},{"$f":"I120*D120","v":0},{"$f":"G120-J120","v":0},{"$f":"J123","v":0}]
[null,"1 PUAN İNDİRİMLİ ORANA TABİ KISIM  (İMALAT)",{"$f":"E93","v":0.83131441837346809},{"$f":"C119*C121","v":0},{"$f":"D121*$H$94","v":0},{"$f":"D121/100","v":0},{"$f":"E121-F121","v":0},{"$f":"G121","v":0},{"$f":"($H$94-0.01)-(($H$94-0.01)*F82)","v":0.24},{"$f":"I121*D121","v":0},{"$f":"G121-J121","v":0}]
[null,"5 PUAN İNDİRİMLİ ORANA TABİ KISIM  ( İHRACAT)",{"$f":"D93","v":0.16868558162653188},{"$f":"C119*C122","v":0},{"$f":"D122*$H$94","v":0},{"$f":"D122/20","v":0},{"$f":"E122-F122","v":0},0,{"$f":"($H$94-0.05)-(($H$94-0.05)*F82)","v":0.2},0,{"$f":"G122-J122","v":0}]
[null,"TOPLAM",{"$f":"SUM(C120:C122)","v":1},0,0,{"$f":"SUM(F120:F122)","v":0},{"$f":"SUM(G120:G122)","v":0},{"$f":"SUM(H120:H122)","v":0},null,{"$f":"SUM(J120:J122)","v":0},0]
[null,"32/A UYGULANABİLECEK MATRAH (5.TEŞVİK BELGESİ)",{"$f":"G84","v":0},"KV MATRAHI","1 - 5 PUAN İNDİRİM OLMASAYDI HESAPLANAN KV TUTARI","1-5 Puan İndirim Tutarı","1 - 5 Puan İndirim Sonrasında Hesaplanan KV Tutarı","32/A İndirimi Olmasaydı Ödenecek KV Tutarı","1 -5 Puan İndirim ve 32/A VİO Uygulandıktan Sonra Tatbik Edilecek KV Oranı","1 - 5 Puan İndirim ve 32/A İndirimi Uygulandıktan Sonra Ödenecek  KV Tutarı","Yararlanılan Yatırıma Katkı Tutarı\n(32/A İnd. KV Nedeniyle Vazgeçilen Vergi Tutarı)","Ödenecek KV Tutarı"]
[null,"GENEL ORANA TABİ KISIM (DİĞER FAALİYETLER)",{"$f":"F93","v":0},{"$f":"C124*C125","v":0},{"$f":"D125*$H$94","v":0},0,{"$f":"E125-F125","v":0},{"$f":"G125","v":0},{"$f":"($H$94)-(($H$94)*G82)","v":0.25},{"$f":"I125*D125","v":0},{"$f":"G125-J125","v":0},{"$f":"J128","v":0}]
[null,"1 PUAN İNDİRİMLİ ORANA TABİ KISIM  (İMALAT)",{"$f":"E93","v":0.83131441837346809},{"$f":"C124*C126","v":0},{"$f":"D126*$H$94","v":0},{"$f":"D126/100","v":0},{"$f":"E126-F126","v":0},{"$f":"G126","v":0},{"$f":"($H$94-0.01)-(($H$94-0.01)*G82)","v":0.24},{"$f":"I126*D126","v":0},{"$f":"G126-J126","v":0}]
[null,"5 PUAN İNDİRİMLİ ORANA TABİ KISIM  ( İHRACAT)",{"$f":"D93","v":0.16868558162653188},{"$f":"C124*C127","v":0},{"$f":"D127*$H$94","v":0},{"$f":"D127/20","v":0},{"$f":"E127-F127","v":0},0,{"$f":"($H$94-0.05)-(($H$94-0.05)*G82)","v":0.2},0,{"$f":"G127-J127","v":0}]
[null,"TOPLAM",{"$f":"SUM(C125:C127)","v":1},0,0,{"$f":"SUM(F125:F127)","v":0},{"$f":"SUM(G125:G127)","v":0},{"$f":"SUM(H125:H127)","v":0},null,{"$f":"SUM(J125:J127)","v":0},0]
[null,"32/A UYGULANAMAYACAK MATRAH",{"$f":"IF(C85<=0,0,C85)","v":49075173.719999999},"KV MATRAHI","1-5 PUAN İNDİRİM OLMASAYDI HESAPLANAN KV TUTARI","1-5 Puan İndirim Tutarı","1 -5 Puan İndirim Sonrasında Hesaplanan KV Tutarı","32/A İNDİRİMİ UYGULANMAZ",null,"1 Puan İndirim ve 32/A İndirimi Uygulandıktan Sonra Ödenecek  KV Tutarı","Yararlanılan Yatırıma Katkı Tutarı\n(32/A İnd. KV Nedeniyle Vazgeçilen Vergi Tutarı)","Ödenecek KV Tutarı"]
[null,"GENEL ORANA TABİ KISIM (DİĞER FAALİYETLER)",{"$f":"F93","v":0},{"$f":"C129*C130","v":0},{"$f":"D130*$H$94","v":0},0,{"$f":"E130-F130","v":0},null,null,{"$f":"G130","v":0},{"$f":"G130-J130","v":0},{"$f":"J133","v":11446910.723904748}]
[null,"1 PUAN İNDİRİMLİ ORANA TABİ KISIM  (İMALAT)",{"$f":"E93","v":0.83131441837346809},{"$f":"C131*C129","v":40796899.497618705},{"$f":"D131*$H$94","v":10199224.874404676},{"$f":"D131/100","v":407968.99497618707},{"$f":"E131-F131","v":9791255.8794284891},null,null,{"$f":"G131","v":9791255.8794284891},{"$f":"G131-J131","v":0}]
[null,"5 PUAN İNDİRİMLİ ORANA TABİ KISIM  ( İHRACAT)",{"$f":"D93","v":0.16868558162653188},{"$f":"C132*C129","v":8278274.2223812919},{"$f":"D132*$H$94","v":2069568.555595323},{"$f":"D132/20","v":413913.7111190646},{"$f":"E132-F132","v":1655654.8444762584},null,null,1655654.8444762584,0]
[null,"TOPLAM",{"$f":"SUM(C130:C132)","v":1},{"$f":"SUM(D130:D132)","v":49075173.719999999},12268793.43,{"$f":"SUM(F130:F132)","v":821882.70609525172},{"$f":"SUM(G130:G132)","v":11446910.723904748},null,null,11446910.723904748,0]
[null,"TOPLAM KV MATRAHI VE ÖDENMESİ GEREKEN KV ",{"$f":"C104+C129+C109+C114+C119+C124","v":49075173.719999999},{"$f":"D108+D133+D113+D118+D123+D128","v":49075173.719999999},{"$f":"E108+E133+E113+E118+E123+E128","v":12268793.43},{"$f":"F108+F133+F113+F118+F123+F128","v":821882.70609525172},{"$f":"G108+G133+G113+G118+G123+G128","v":11446910.723904748},null,null,{"$f":"J108+J133+J113+J118+J123+J128","v":11446910.723904748},{"$f":"K133+K108+K113+K118+K123+K128","v":0},{"$f":"L105+L130+L110+L115+L120+L125","v":11446910.723904748}]
[]
[null,"GEÇİCİ VERGİ BEYANNMESİNDE MATRAH BİLDİRİMİ BÖLÜMÜNDE DOLDURULACAK KISIMLAR VE TUTARLARI"]
[null,"32 A Madde Kapsamında İndirimli Kurumlar Vergisine (Geçici Vergiye) Tabi Matrah",{"$f":"C104+C109+C114+C119+C124","v":0},{"$f":"E108+E113+E118+E123+E128","v":0},"1-5 Puan Olmasaydı Hesaplan KV Tutarı"]
[null,null,null,{"$f":"G108+G113+G118+G123++G128","v":0},"1 -5 Puan İndirim Sonrasında Ödenecek KV Tutarı\n (32 A olmasaydı hesaplanacak Vergi)"]
[null,null,null,{"$f":"K108+K113+K118+K123+K128","v":0},"32/A İndirimi ile Vazgeçilen Vergi"]
[null,"32 A Madde Kapsamında İndirimli Kurumlar Vergisi(Geçici Vergi) Oranı",{"$f":"IFERROR(D140/C137,0)","v":0},{"$f":"L105+L110+L115+L120+L125","v":0},"32/A ya Tabi Matrah Üzerinden Ödenecek KV"]
[null,"32/7 Madde Kapsamında İndirimli Kurumlar Vergisine (Geçici Vergiye) Tabi Matrah  (İhracat)",{"$f":"D132","v":8278274.2223812919},{"$f":"E132","v":2069568.555595323},"5 Puan Olmasaydı Hesaplan KV Tutarı"]
[null,null,null,{"$f":"F132","v":413913.7111190646},"5 Puan İndirimin Vergi Etkisi "]
[null,"32/7 Madde Kapsamında İndirimli Kurumlar Vergisi (Geçici Vergi) Oranı",{"$f":"IFERROR(D143/C141,0)","v":0.2},{"$f":"G132","v":1655654.8444762584},"5 Puan İndirim Sonrasında Ödenecek KV Tutarı (İhracat)\n"]
[null,"32/8 Madde Kapsamında İndirimli Kurumlar Vergisine (Geçici Vergiye) Tabi Matrah  (Üretim)",{"$f":"D131","v":40796899.497618705},{"$f":"E131","v":10199224.874404676},"1 Puan Olmasaydı Hesaplan KV Tutarı"]
[null,null,null,{"$f":"F131","v":407968.99497618707},"1 Puan İndirimin Vergi Etkisi "]
[null,"32/8 Madde Kapsamında İndirimli Kurumlar Vergisi (Geçici Vergi) Oranı",{"$f":"IFERROR(D146/C144,0)","v":0.24},{"$f":"G131","v":9791255.8794284891},"1 Puan İndirim Sonrasında Ödenecek KV Tutarı (Üretim)\n"]
[null,"Genel Orana Tabi Matrah (Diğer)",{"$f":"D130","v":0},{"$f":"J130","v":0},"Diğer Faalilyetlerden Elde Edilen Kazanç"]
[null,null,{"$f":"IFERROR(D147/C147,0)","v":0}]
[null,"MATRAHLAR TOPLAMI",{"$f":"C137+C144+C141+C147","v":49075173.719999999},{"$f":"D140+D146+D143+D147","v":11446910.723904748}]

{"sheet":"ŞABLON (32 6 BİST İNDİRİMSİZ)","index":1,"n_rows":149,"n_cols":12,"rows_kept":149,"cut":false,"hidden":false,"merged":[[84,2,84,6],[1,1,2,1],[59,1,59,2],[60,1,60,2],[71,1,72,1],[73,1,73,2],[74,1,74,2],[74,3,74,4],[75,1,75,2],[75,3,75,4],[79,1,79,3],[82,2,82,6],[85,2,85,6],[87,1,89,1],[87,2,88,2],[87,3,88,3],[87,4,88,4],[87,5,88,5],[135,1,135,4],[137,1,138,2],[104,11,107,11],[109,11,112,11],[114,11,117,11],[119,11,122,11],[124,11,127,11],[128,7,133,8],[129,11,132,11]]}
[]
[null,"FAALİYET TÜRLERİ İTİBARİYLE HASILATLAR VE TOPLAM İÇİNDEKİ ORANLARI",{"$f":"IFERROR(C4/C4,0)","v":0},{"$f":"IFERROR(D4/C4,0)","v":0},{"$f":"IFERROR(E4/C4,0)","v":0},{"$f":"IFERROR(F4/C4,0)","v":0}]
[null,null,"Toplam Hasılat","İhracat faaliyeti","İmalat faaliyeti","Diğer faaliyetler"]
[null,"A-BRÜT SATIŞLAR (60)",{"$f":"D4+E4+F4","v":0},{"$f":"SUM(D5:D7)","v":0},{"$f":"SUM(E5:E7)","v":0},0]
[null,"1-Yurtiçi Satışlar (600)",{"$f":"D5+E5+F5","v":0}]
[null,"2-Yurtdışı Satışlar (601)",{"$f":"D6+E6+F6","v":0}]
[null,"3-Diğer Gelirler (602)",{"$f":"D7+E7+F7","v":0}]
[null,"B-SATIŞ İNDİRİMLERİ(-) (61)",{"$f":"SUM(C9:C11)","v":0},{"$f":"SUM(D9:D11)","v":0},{"$f":"SUM(E9:E11)","v":0},0]
[null,"1-Satıştan İadeler (-) (610)",{"$f":"SUM(D9:F9)","v":0}]
[null,"2- Satış İskontoları (-) (611)",{"$f":"SUM(D10:F10)","v":0}]
[null,"3-Diğer İndirimler (-) (612)",0]
[null,"C-NET SATIŞLAR",{"$f":"C4-C8","v":0},{"$f":"D4-D8","v":0},{"$f":"E4-E8","v":0},0]
[null,"D-SATIŞLARIN MALİYETİ (-) (62)",{"$f":"SUM(C14:C17)","v":0},{"$f":"SUM(D14:D17)","v":0},{"$f":"SUM(E14:E17)","v":0},{"$f":"SUM(F14:F17)","v":0}]
[null,"1-Satılan Mamuller Maliyeti ( 620)",{"$f":"SUM(D14:F14)","v":0}]
[null,"2-Satılan Ticari Mal Maliyeti (621)",{"$f":"SUM(D15:F15)","v":0}]
[null,"3-Satılan Hizmet Maliyeti (622)",0]
[null,"4-Diğer Satışların Maliyeti (623)",0]
[null,"BRÜT SATIŞ KARI / ZARARI",{"$f":"C12-C13","v":0},{"$f":"D12-D13","v":0},{"$f":"E12-E13","v":0},0]
[null,"E-FAALİYET GİDERLERİ (-) (63)",{"$f":"SUM(C20:C24)","v":0},{"$f":"SUM(D20:D24)","v":0},{"$f":"SUM(E20:E24)","v":0},0]
[null,"1-Araştırma ve Geliştirme Giderleri(-) (630)",{"$f":"SUM(D20:F20)","v":0}]
[null,"2-Pazarlama, Satış ve Dağıtım Giderleri(-) (631)",{"$f":"SUM(D21:F21)","v":0}]
[null,"3-Genel Yönetim Giderleri(-) (632)",{"$f":"SUM(D22:F22)","v":0}]
[null,"MÜŞTEREK GENEL GİDERLER (DAĞITIM-HASILAT PAYINA GÖRE)",null,{"$f":"C23*D2","v":0},{"$f":"C23*E2","v":0},{"$f":"C23*F2","v":0}]
[null,"MÜŞTEREK GENEL GİDER GİBİ DAĞITIMA TABİ TUTULACAK AMORTİSMAN GİDERLERİ  (DAĞITIM-HASILAT PAYINA GÖRE)",null,{"$f":"C24*D2","v":0},{"$f":"C24*E2","v":0},{"$f":"C24*F2","v":0}]
[null,"FAALİYET KARI / ZARARI ",{"$f":"C18-C19","v":0},{"$f":"D18-D19","v":0},{"$f":"E18-E19","v":0},0]
[null,"F-DİĞER FAALİYETLERDEN OLAĞAN GELİR VE KARLAR (64)",{"$f":"SUM(C27:C35)","v":0},{"$f":"SUM(D27:D35)","v":0},{"$f":"SUM(E27:E35)","v":0},{"$f":"SUM(F27:F35)","v":0}]
[null,"         1- İŞTİRAKLERDEN TEMETTÜ GELİRLERİ (640)",{"$f":"SUM(D27:F27)","v":0}]
[null,"         2- BAĞLI ORTAKLIKLARDAN TEMETTÜ GELİRLERİ (641)",{"$f":"SUM(D28:F28)","v":0}]
[null,"         3- FAİZ GELİRLERİ (642) (ihracat ve imalat kaynaklı alacağın tahsiline kadar olan süreçte oluşan)",0]
[null,"         4- KOMİSYON GELİRLERİ (643)",0]
[null,"         5- KONUSU OLMAYAN KARŞILIKLAR (644)",0]
[null,"         6- MENKUL KIYMET SATIŞ KARLARI (645)",0]
[null,"         7- KAMBİYO KARLARI (646) (ihracat ve imalat kaynaklı alacağın tahsiline kadar olan süreçte oluşan)",0]
[null,"         8- REESKONT FAİZ GELİRLERİ (647)",0]
[null,"         9- FAALİYETLE İLGİLİ DİĞER GELİR VE KARLAR (649)",0]
[null,"ARA TOPLAM",{"$f":"C25+C26","v":0},{"$f":"D25+D26","v":0},{"$f":"E25+E26","v":0},{"$f":"F25+F26","v":0}]
[null,"G-DİĞER FAALİYETLERDEN OLAĞAN GİDER VE ZARARLAR(-) (65)",{"$f":"SUM(C38:C43)","v":0},{"$f":"SUM(D38:D43)","v":0},{"$f":"SUM(E38:E43)","v":0},0]
[null,"         1- KOMİSYON GİDERLERİ (653)",{"$f":"SUM(D38:F38)","v":0}]
[null,"         2- KARŞILIK GİDERLERİ (654)",{"$f":"SUM(D39:F39)","v":0}]
[null,"         3- MENKUL KIYMET SATIŞ ZARARLARI (655)",0]
[null,"         4- KAMBİYO ZARARLARI (656) (ihracat ve imalat kaynaklı alacağın tahsiline kadar olan süreçte oluşan)",0]
[null,"         5- REESKONT FAİZ GİDERLERİ (657)",0]
[null,"         6- DİĞER OLAĞAN GİDER VE ZARARLAR (659)",{"$f":"SUM(D43:F43)","v":0}]
[null,"ARA TOPLAM",{"$f":"C36-C37","v":0},{"$f":"D36-D37","v":0},{"$f":"E36-E37","v":0},0]
[null,"H-FİNANSMAN GİDERLERİ(-) (66)",{"$f":"SUM(C46:C49)","v":0},{"$f":"SUM(D46:D49)","v":0},{"$f":"SUM(E46:E49)","v":0},{"$f":"SUM(F46:F49)","v":0}]
[null,"         1- KISA VADELİ BORÇLANMA GİDERLERİ (-)",{"$f":"SUM(D46:F46)","v":0}]
[null,"         2- UZUN VADELİ BORÇLANMA GİDERLERİ (-)",{"$f":"SUM(D47:F47)","v":0}]
[null,"         1- KISA VADELİ BORÇLANMA GİDERLERİ (-) (DAĞITIM)",null,{"$f":"C48*D2","v":0},{"$f":"C48*E2","v":0},{"$f":"C48*F2","v":0}]
[null,"         2- UZUN VADELİ BORÇLANMA GİDERLERİ (-) (DAĞITIM)",null,{"$f":"C49*D2","v":0},{"$f":"C49*E2","v":0},{"$f":"C49*F2","v":0}]
[null,"ARA TOPLAM",{"$f":"C44-C45","v":0},{"$f":"D44-D45","v":0},{"$f":"E44-E45","v":0},{"$f":"F44-F45","v":0}]
[null,"I-OLAĞANDIŞI GELİR VE KÂRLAR (67)",{"$f":"SUM(D51:F51)","v":0},{"$f":"SUM(D52:D53)","v":0},{"$f":"SUM(E52:E53)","v":0},{"$f":"SUM(F52:F53)","v":0}]
[null,"1- ÖNCEKİ DÖNEM GELİR VE KARLARI (671)",{"$f":"SUM(D52:F52)","v":0}]
[null,"2-DİĞER OLAĞAN DIŞI GELİR VE KARLAR (679)",{"$f":"SUM(D53:F53)","v":0}]
[null,"ARA TOPLAM",{"$f":"SUM(D54:F54)","v":0},{"$f":"D50+D51","v":0},{"$f":"E50+E51","v":0},0]
[null,"J-OLAĞANDIŞI GİDER VE ZARARLAR(-) (68)",{"$f":"SUM(C56:C58)","v":0},{"$f":"SUM(D56:D58)","v":0},{"$f":"SUM(E56:E58)","v":0},0]
[null,"1-Çalışmayan Kısım Gider ve Zararları(-) (680)",{"$f":"SUM(D56:F56)","v":0}]
[null,"2-Önceki Dönem Gider ve Zararları(-) (681)",{"$f":"SUM(D57:F57)","v":0}]
[null,"3-Diğer Olağan Dışı Gider ve Zararlar(-) (689)",0]
[null,"DÖNEM KÂRI VEYA ZARARI \n(TİCARİ BİLANÇO KARI ZARARI )",{"$f":"C54-C55","v":0},{"$f":"D54-D55","v":0},{"$f":"E54-E55","v":0},0]
[null,"İHRACAT, İMALAT VE DİĞER FAALİYETLERDEN ELDE EDİLEN KAZANCIN TOPLAM TİCARİ KAZANÇ İÇİNDEKİ PAYLARI  ",null,{"$f":"IF(D59>=$C$59,1,\n    IF(D59<=0,0,\n    IF(AND(D59>0,D59<$C$59),D59/$C$59)))","v":1},{"$f":"IF(E59>=$C$59,1,\n    IF(E59<=0,0,\n    IF(AND(E59>0,E59<$C$59),E59/$C$59)))","v":1},{"$f":"IF(F59>=$C$59,1,\n    IF(F59<=0,0,\n    IF(AND(F59>0,F59<$C$59),F59/$C$59)))","v":1}]
[null,"TOPLAM İÇİNDEKİ PAYI",null,{"$f":"D60/(D60+E60+F60)","v":0.33333333333333331},{"$f":"E60/(D60+E60+F60)","v":0.33333333333333331},{"$f":"F60/(D60+E60+F60)","v":0.33333333333333331}]
[]
[null,"KKEG +"]
[null," KABUL EDİLMEYEN GELİRLER -"]
[null,"ZARAR OLSA DAHİ İNDİRİLECEK İSTİSNALAR -",{"$f":"C66+C67+C68","v":0}]
[null,"Hizmet İhracatı Faaliyetinden (KVK 10-1/ğ) Elde Edilen Kazançlardan İstisna Edilenlerin Toplamı"]
[null,"İmalat Faaliyetinden Elde Edilen Kazançlardan İstisna Edilenlerin Toplamı"]
[null,"Diğer Faaliyetlerden Elde Edilen Kazançlardan İstisna Edilenlerin Toplamı"]
[null,"GEÇMİŞ YIL ZARARLARI -"]
[null,"İNDİRİMLER -",null,"AZAMİ YAZILABİLECEK İNDİRİMLER TUTARI",{"$f":"C59+C63-C64-C65-C69","v":0}]
[]
[null,"1 PUAN İNDİRİM UYGULANACAK TUTARIN HESABINDA İSTİSNA KAZANÇLAR DÜŞÜLDÜKTEN SONRA BULUNAN TİCARİ KAZANÇ TUTARI İLE  İHRACAT,İMALAT VE DİĞER KAZANÇLARIN TUTARI","TİCARİ KAZANÇ TAN İhracat ve İmalat Kazancından İstisna Olan Tutarlar Düşüldükten Sonra Kalan Tutarı","İhracat Faaliyetinden Elde Edilen  Kazançtan İstisna Olan Kısım Düşüldükten Sonra Bulunan Tutarı","Üretim  Faaliyetinden Elde Edilen  Kazançtan İstisna Olan Kısım Düşüldükten Sonra Bulunan Tutarı","Diğer Faaliyetinden Elde Edilen  Kazanç"]
[null,null,{"$f":"IF(C59-C66-C67<=0,0,C59-C66-C67)","v":0},{"$f":"IF($D$59-C66<=0,0,MIN($D$59-C66,$C$73*D61))","v":0},{"$f":"IF($E$59-C67<=0,0,MIN($E$59-C67,$C$73*E61))","v":0},{"$f":"IF(C73-D73-E73<=0,0,C73-D73-E73)","v":0}]
[null,"MATRAH DAĞITIM PAYLARI",null,{"$f":"IFERROR(IF(D73/C73<=0,0,D73/C73),0)","v":0},{"$f":"IFERROR(IF(E73/C73<=0,0,E73/C73),0)","v":0},{"$f":"IFERROR(F73/C73,0)","v":0}]
[null,"İHRACAT, İMALAT VE DİĞER FAALİYETLERDEN ELDE EDİLEN KAZANCIN TOPLAM TİCARİ KAZANÇ İÇİNDEKİ PAYLARI ",null,{"$f":"IFERROR(IF(AND(D73+E73>C73, F73<=0),1,(D73+E73)/C73),0)","v":0},null,{"$f":"IFERROR(IF(F73<=0,0,F73/C73),0)","v":0}]
[null,"NEGATİF VE % 100 DEN BÜYÜKLÜK KONTROLÜ SONRASINDAKİ PAYLARI",null,{"$f":"IFERROR(IF(D75<=0,0,IF(D75>1,1,D75)),0)","v":0},null,{"$f":"IFERROR(IF(F75<=0,0,IF(F75>1,1,F75)),0)","v":0}]
[]
[null,"SAFİ KURUM KAZANCI \n(KURUMLAR VERGİSİ MATRAHI)",{"$f":"C59+C63-C64-C65-C69-C70","v":0},{"$f":"IF(C78<0, \"ZARAR\",\"KAR\")","v":"KAR"}]
[]
[null,"2022 YILI 3. DÖNEM İNDİRİMLİ KURUMLAR VERGİSİ HESAPLAMA TABLOSU"]
[null,null,"1. TEŞVİK BELGESİ","2. TEŞVİK BELGESİ","3. TEŞVİK BELGESİ","4. TEŞVİK BELGESİ","5. TEŞVİK BELGESİ"]
[null,"Vergi İndirim Oranı (VİO)"]
[null,"KV MATRAHI (Safi Kurum Kazancı)",{"$f":"C78","v":0}]
[null,"32/A  Uygulanacak K.V. Matrahı (HER BİR TEŞVİK BELGESİ KAPSAMINDA YARARLANILABİLECEK YATIRIMA KATKI TUTARININ MATRAHI BU HÜCRELERE YAZILMALIDIR)",null,null,null,null,null,{"$f":"IF(SUM(C84:G84)>C78,\"32/A İNDİRİMİ UYGULANACAK KAZANÇ, SAFİ KURUM KAZANCINDAN FAZLADIR\",SUM(C84:G84))","v":0}]
[null,"32/A UYGULANMAYACAK K.V.  Matrahı",{"$f":"IF(C83-(C84+D84+E84+F84+G84)<0,0,C83-(C84+D84+E84+F84+G84))","v":0}]
[null,"MATRAH TOPLAMI",{"$f":"IF((C84+D84+E84+F84+G84+C85)>C78,C78,(C84+D84+E84+F84+G84+C85))","v":0}]
[]
[null,"SAFİ KURUM KAZANCININ  KV VERGİ ORANLARI İTİBARİYLE DAĞILIMI ","TOPLAM SAFİ KAZANÇ","İhracat Kazancı Payı","Üretim Kazancı Payı","Diğer Faaliyet Kazancı Payı"]
[]
[null,null,{"$f":"C78","v":0},{"$f":"IF(AND(AND($D$59>0,($D$59+$E$59)>=$C$59,D59>=C66),$C$90>=MAX(D59,D73)),\n\nMIN(MAX(IF(D59<=C90,D59,IF(D73<=C90,D73)),$C$90*D74)),\n\nIF(OR(D59<=0,D73<=0),0,\n\nMIN( MAX(   MAX(   IF(D59<=C90,D59),  IF(D73<=C90,D73) ),    MIN($C$90*D74,D59,D73)),$C$90)))","v":0},{"$f":"MIN( IF(AND(AND($E$59>0,($D$59+$E$59)>=$C$59,E59>=C67),$C$90>=MAX(E59,E73)),\n\nMIN(MAX(IF(E59<=C90,E59,IF(E73<=C90,E73)),$C$90*E74)),\n\nIF(OR(E59<=0,E73<=0),0,\n\nMIN( MAX(   MAX(   IF(E59<=C90,E59),  IF(E73<=C90,E73) ),    MIN($C$90*E74,E59,E73)),$C$90))),C90-D90)","v":0},{"$f":"C90-D90-E90","v":0}]
[null,"SAFİ KURUM KAZANCININ DAĞILIMI ORANSAL DAĞILIMI",{"$f":"C90","v":0},{"$f":"IFERROR(D90/C90,0)","v":0},{"$f":"IFERROR(E90/D90,0)","v":0},{"$f":"IFERROR(F90/E90,0)","v":0}]
[null,"SAFİ KURUM KAZANCININ DAĞILIMI TUTARSAL",{"$f":"C91","v":0},{"$f":"D90","v":0},{"$f":"E90","v":0},{"$f":"F90","v":0}]
[null,"SAFİ KURUM KAZANCI DAĞILIMI",{"$f":"C92","v":0},{"$f":"IFERROR(IF(D92/C92>=1,1,D92/C92),0)","v":0},{"$f":"IFERROR(IF(E92/C92>=1,1,E92/C92),0)","v":0},{"$f":"IFERROR(IF(F92/C92>=1,1,F92/C92),0)","v":0},null,"KV ORANI"]
[null,"1 PUAN VE 32/A İNDİRİMİ OLMASAYDI HESAPLANAN KV TUTARI",{"$f":"C93*$H$94","v":0},{"$f":"D92*$H$94","v":0},{"$f":"E92*$H$94","v":0},{"$f":"F92*$H$94","v":0},null,0.25]
[null,"32/ A UYGULANAN MATRAH",{"$f":"C84+D84+E84+F84+G84","v":0},{"$f":"D107+D112+D117+D122+D127","v":0},{"$f":"D106+D111+D116+D121+D126","v":0},{"$f":"D105+D110+D115+D120+D125","v":0}]
[null,"32/A UYGULANACAK MATRAH ÜZERİNDEN ÖDENECEK KV TUTARI",{"$f":"J108+J113+J118+J123+J128","v":0},{"$f":"J107+J112+J117+J122+J127","v":0},{"$f":"J106+J111+J116+J121+J126","v":0},{"$f":"J105+J110+J115+J120+J125","v":0}]
[null,"32/A UYGULANMAYAN MATRAH",{"$f":"IF(C85<=0,0,C85)","v":0},{"$f":"D132","v":0},{"$f":"D131","v":0},{"$f":"D130","v":0}]
[null,"32/A UYGULANMAYAN MATRAH ÜZERİNDEN ÖDENECEK KV TUTARI",{"$f":"L130","v":0},{"$f":"J132","v":0},{"$f":"J131","v":0},{"$f":"J130","v":0}]
[null,"TOPLAM ÖDENECEK KV",{"$f":"C96+C98","v":0},{"$f":"J132+J107","v":0},{"$f":"J131+J106","v":0},{"$f":"J130+J105","v":0}]
[null,"TOPLAM AVANTAJ  (YARARLANILAN 1 PUAN İNDİRİMİ + 32/A İNDİRİMİ TUTARI )",{"$f":"C94-C99","v":0},{"$f":"D101+D102","v":0},{"$f":"E101+E102","v":0},{"$f":"F101+F102","v":0}]
[null,"YARARLANILAN 1 - 5 PUAN İNDİRİMİ TUTARI",{"$f":"F133+F128+F123+F118+F113+F108","v":0},{"$f":"F132+F107+F112+F117+F122+F127","v":0},{"$f":"F131+F106+F111+F116+F121+F126","v":0},{"$f":"F130+F105+F110+F115+F120+F125","v":0}]
[null,"YARLANILAN 32/A İNDİRİMİ TUTARI",{"$f":"K108+K113+K118+K123+K128+K133","v":0},{"$f":"K107+K112+K122+K127+K132","v":0},{"$f":"K106+K111+K116+K121+K126+K131","v":0},{"$f":"K105++K110+K115+K120+K125+K130","v":0}]
[]
[null,"32/A UYGULANABİLECEK MATRAH (1.TEŞVİK BELGESİ)",{"$f":"C84","v":0},"KV MATRAHI","1 - 5 PUAN İNDİRİM OLMASAYDI HESAPLANAN KV TUTARI","1 -5 Puan İndirim Tutarı","1 - 5 Puan İndirim Sonrasında Hesaplanan KV Tutarı","32/A İndirimi Olmasaydı Ödenecek KV Tutarı","1 -5 Puan İndirim ve 32/A VİO Uygulandıktan Sonra Tatbik Edilecek KV Oranı","1 -5 Puan İndirim ve 32/A İndirimi Uygulandıktan Sonra Ödenecek  KV Tutarı","Yararlanılan Yatırıma Katkı Tutarı\n(32/A İnd. KV Nedeniyle Vazgeçilen Vergi Tutarı)","Ödenecek KV Tutarı"]
[null,"GENEL ORANA TABİ KISIM (DİĞER FAALİYETLER)",{"$f":"F93","v":0},{"$f":"C104*C105","v":0},{"$f":"D105*$H$94","v":0},0,{"$f":"E105-F105","v":0},{"$f":"G105","v":0},{"$f":"($H$94)-(($H$94)*$C$82)","v":0.25},{"$f":"I105*D105","v":0},{"$f":"G105-J105","v":0},{"$f":"J108","v":0}]
[null,"1 PUAN İNDİRİMLİ ORANA TABİ KISIM  (İMALAT)",{"$f":"E93","v":0},{"$f":"C104*C106","v":0},{"$f":"D106*$H$94","v":0},{"$f":"D106/100","v":0},{"$f":"E106-F106","v":0},{"$f":"G106","v":0},{"$f":"($H$94-0.01)-(($H$94-0.01)*$C$82)","v":0.24},{"$f":"I106*D106","v":0},{"$f":"G106-J106","v":0}]
[null,"5 PUAN İNDİRİMLİ ORANA TABİ KISIM  ( İHRACAT)",{"$f":"D93","v":0},{"$f":"C104*C107","v":0},{"$f":"D107*$H$94","v":0},{"$f":"D107/20","v":0},{"$f":"E107-F107","v":0},0,{"$f":"($H$94-0.05)-(($H$94-0.05)*C82)","v":0.2},0,{"$f":"G107-J107","v":0}]
[null,"TOPLAM",{"$f":"SUM(C105:C107)","v":0},{"$f":"SUM(D105:D107)","v":0},0,{"$f":"SUM(F105:F107)","v":0},{"$f":"SUM(G105:G107)","v":0},{"$f":"SUM(H105:H107)","v":0},null,0,0]
[null,"32/A UYGULANABİLECEK MATRAH (2.TEŞVİK BELGESİ)",{"$f":"D84","v":0},"KV MATRAHI","1 - 5 PUAN İNDİRİM OLMASAYDI HESAPLANAN KV TUTARI","1 -5 Puan İndirim Tutarı","1 -5 Puan İndirim Sonrasında Hesaplanan KV Tutarı","32/A İndirimi Olmasaydı Ödenecek KV Tutarı","1 - 5 Puan İndirim ve 32/A VİO Uygulandıktan Sonra Tatbik Edilecek KV Oranı","1-5  Puan İndirim ve 32/A İndirimi Uygulandıktan Sonra Ödenecek  KV Tutarı","Yararlanılan Yatırıma Katkı Tutarı\n(32/A İnd. KV Nedeniyle Vazgeçilen Vergi Tutarı)","Ödenecek KV Tutarı"]
[null,"GENEL ORANA TABİ KISIM (DİĞER FAALİYETLER)",{"$f":"F93","v":0},{"$f":"C109*C110","v":0},{"$f":"D110*$H$94","v":0},0,{"$f":"E110-F110","v":0},{"$f":"G110","v":0},{"$f":"($H$94)-(($H$94)*D82)","v":0.25},{"$f":"I110*D110","v":0},{"$f":"G110-J110","v":0},{"$f":"J113","v":0}]
[null,"1 PUAN İNDİRİMLİ ORANA TABİ KISIM  (İMALAT)",{"$f":"E93","v":0},{"$f":"C109*C111","v":0},{"$f":"D111*$H$94","v":0},{"$f":"D111/100","v":0},{"$f":"E111-F111","v":0},{"$f":"G111","v":0},{"$f":"($H$94-0.01)-(($H$94-0.01)*D82)","v":0.24},{"$f":"I111*D111","v":0},{"$f":"G111-J111","v":0}]
[null,"5 PUAN İNDİRİMLİ ORANA TABİ KISIM  ( İHRACAT)",{"$f":"D93","v":0},{"$f":"C109*C112","v":0},{"$f":"D112*$H$94","v":0},{"$f":"D112/20","v":0},{"$f":"E112-F112","v":0},0,{"$f":"($H$94-0.05)-(($H$94-0.05)*D82)","v":0.2},0,{"$f":"G112-J112","v":0}]
[null,"TOPLAM",{"$f":"SUM(C110:C112)","v":0},0,0,{"$f":"SUM(F110:F112)","v":0},{"$f":"SUM(G110:G112)","v":0},{"$f":"SUM(H110:H112)","v":0},null,{"$f":"SUM(J110:J112)","v":0},0]
[null,"32/A UYGULANABİLECEK MATRAH (3.TEŞVİK BELGESİ)",{"$f":"E84","v":0},"KV MATRAHI","1 - 5 PUAN İNDİRİM OLMASAYDI HESAPLANAN KV TUTARI","1-5 Puan İndirim Tutarı","1 - 5 Puan İndirim Sonrasında Hesaplanan KV Tutarı","32/A İndirimi Olmasaydı Ödenecek KV Tutarı","1 - 5 Puan İndirim ve 32/A VİO Uygulandıktan Sonra Tatbik Edilecek KV Oranı","1 -5 Puan İndirim ve 32/A İndirimi Uygulandıktan Sonra Ödenecek  KV Tutarı","Yararlanılan Yatırıma Katkı Tutarı\n(32/A İnd. KV Nedeniyle Vazgeçilen Vergi Tutarı)","Ödenecek KV Tutarı"]
[null,"GENEL ORANA TABİ KISIM (DİĞER FAALİYETLER)",{"$f":"F93","v":0},{"$f":"C114*C115","v":0},{"$f":"D115*$H$94","v":0},0,{"$f":"E115-F115","v":0},{"$f":"G115","v":0},{"$f":"($H$94)-(($H$94)*E82)","v":0.25},{"$f":"I115*D115","v":0},{"$f":"G115-J115","v":0},{"$f":"J118","v":0}]
[null,"1 PUAN İNDİRİMLİ ORANA TABİ KISIM  (İMALAT)",{"$f":"E93","v":0},{"$f":"C114*C116","v":0},{"$f":"D116*$H$94","v":0},{"$f":"D116/100","v":0},{"$f":"E116-F116","v":0},{"$f":"G116","v":0},{"$f":"($H$94-0.01)-(($H$94-0.01)*E82)","v":0.24},{"$f":"I116*D116","v":0},{"$f":"G116-J116","v":0}]
[null,"5 PUAN İNDİRİMLİ ORANA TABİ KISIM  ( İHRACAT)",{"$f":"D93","v":0},{"$f":"C114*C117","v":0},{"$f":"D117*$H$94","v":0},{"$f":"D117/20","v":0},{"$f":"E117-F117","v":0},0,{"$f":"($H$94-0.05)-(($H$94-0.05)*E82)","v":0.2},0,{"$f":"G117-J117","v":0}]
[null,"TOPLAM",{"$f":"SUM(C115:C117)","v":0},0,0,{"$f":"SUM(F115:F117)","v":0},{"$f":"SUM(G115:G117)","v":0},{"$f":"SUM(H115:H117)","v":0},null,{"$f":"SUM(J115:J117)","v":0},0]
[null,"32/A UYGULANABİLECEK MATRAH (4. TEŞVİK BELGESİ)",{"$f":"F84","v":0},"KV MATRAHI","1 - 5 PUAN İNDİRİM OLMASAYDI HESAPLANAN KV TUTARI","1-5 Puan İndirim Tutarı","1 -5 Puan İndirim Sonrasında Hesaplanan KV Tutarı","32/A İndirimi Olmasaydı Ödenecek KV Tutarı","1- 5  Puan İndirim ve 32/A VİO Uygulandıktan Sonra Tatbik Edilecek KV Oranı","1-5 Puan İndirim ve 32/A İndirimi Uygulandıktan Sonra Ödenecek  KV Tutarı","Yararlanılan Yatırıma Katkı Tutarı\n(32/A İnd. KV Nedeniyle Vazgeçilen Vergi Tutarı)","Ödenecek KV Tutarı"]
[null,"GENEL ORANA TABİ KISIM (DİĞER FAALİYETLER)",{"$f":"F93","v":0},{"$f":"C119*C120","v":0},{"$f":"D120*$H$94","v":0},0,{"$f":"E120-F120","v":0},{"$f":"G120","v":0},{"$f":"($H$94)-(($H$94)*F82)","v":0.25},{"$f":"I120*D120","v":0},{"$f":"G120-J120","v":0},{"$f":"J123","v":0}]
[null,"1 PUAN İNDİRİMLİ ORANA TABİ KISIM  (İMALAT)",{"$f":"E93","v":0},{"$f":"C119*C121","v":0},{"$f":"D121*$H$94","v":0},{"$f":"D121/100","v":0},{"$f":"E121-F121","v":0},{"$f":"G121","v":0},{"$f":"($H$94-0.01)-(($H$94-0.01)*F82)","v":0.24},{"$f":"I121*D121","v":0},{"$f":"G121-J121","v":0}]
[null,"5 PUAN İNDİRİMLİ ORANA TABİ KISIM  ( İHRACAT)",{"$f":"D93","v":0},{"$f":"C119*C122","v":0},{"$f":"D122*$H$94","v":0},{"$f":"D122/20","v":0},{"$f":"E122-F122","v":0},0,{"$f":"($H$94-0.05)-(($H$94-0.05)*F82)","v":0.2},0,{"$f":"G122-J122","v":0}]
[null,"TOPLAM",{"$f":"SUM(C120:C122)","v":0},0,0,{"$f":"SUM(F120:F122)","v":0},{"$f":"SUM(G120:G122)","v":0},{"$f":"SUM(H120:H122)","v":0},null,{"$f":"SUM(J120:J122)","v":0},0]
[null,"32/A UYGULANABİLECEK MATRAH (5.TEŞVİK BELGESİ)",{"$f":"G84","v":0},"KV MATRAHI","1 - 5 PUAN İNDİRİM OLMASAYDI HESAPLANAN KV TUTARI","1-5 Puan İndirim Tutarı","1 - 5 Puan İndirim Sonrasında Hesaplanan KV Tutarı","32/A İndirimi Olmasaydı Ödenecek KV Tutarı","1 -5 Puan İndirim ve 32/A VİO Uygulandıktan Sonra Tatbik Edilecek KV Oranı","1 - 5 Puan İndirim ve 32/A İndirimi Uygulandıktan Sonra Ödenecek  KV Tutarı","Yararlanılan Yatırıma Katkı Tutarı\n(32/A İnd. KV Nedeniyle Vazgeçilen Vergi Tutarı)","Ödenecek KV Tutarı"]
[null,"GENEL ORANA TABİ KISIM (DİĞER FAALİYETLER)",{"$f":"F93","v":0},{"$f":"C124*C125","v":0},{"$f":"D125*$H$94","v":0},0,{"$f":"E125-F125","v":0},{"$f":"G125","v":0},{"$f":"($H$94)-(($H$94)*G82)","v":0.25},{"$f":"I125*D125","v":0},{"$f":"G125-J125","v":0},{"$f":"J128","v":0}]
[null,"1 PUAN İNDİRİMLİ ORANA TABİ KISIM  (İMALAT)",{"$f":"E93","v":0},{"$f":"C124*C126","v":0},{"$f":"D126*$H$94","v":0},{"$f":"D126/100","v":0},{"$f":"E126-F126","v":0},{"$f":"G126","v":0},{"$f":"($H$94-0.01)-(($H$94-0.01)*G82)","v":0.24},{"$f":"I126*D126","v":0},{"$f":"G126-J126","v":0}]
[null,"5 PUAN İNDİRİMLİ ORANA TABİ KISIM  ( İHRACAT)",{"$f":"D93","v":0},{"$f":"C124*C127","v":0},{"$f":"D127*$H$94","v":0},{"$f":"D127/20","v":0},{"$f":"E127-F127","v":0},0,{"$f":"($H$94-0.05)-(($H$94-0.05)*G82)","v":0.2},0,{"$f":"G127-J127","v":0}]
[null,"TOPLAM",{"$f":"SUM(C125:C127)","v":0},0,0,{"$f":"SUM(F125:F127)","v":0},{"$f":"SUM(G125:G127)","v":0},{"$f":"SUM(H125:H127)","v":0},null,{"$f":"SUM(J125:J127)","v":0},0]
[null,"32/A UYGULANAMAYACAK MATRAH",{"$f":"IF(C85<=0,0,C85)","v":0},"KV MATRAHI","1-5 PUAN İNDİRİM OLMASAYDI HESAPLANAN KV TUTARI","1-5 Puan İndirim Tutarı","1 -5 Puan İndirim Sonrasında Hesaplanan KV Tutarı","32/A İNDİRİMİ UYGULANMAZ",null,"1 Puan İndirim ve 32/A İndirimi Uygulandıktan Sonra Ödenecek  KV Tutarı","Yararlanılan Yatırıma Katkı Tutarı\n(32/A İnd. KV Nedeniyle Vazgeçilen Vergi Tutarı)","Ödenecek KV Tutarı"]
[null,"GENEL ORANA TABİ KISIM (DİĞER FAALİYETLER)",{"$f":"F93","v":0},{"$f":"C129*C130","v":0},{"$f":"D130*$H$94","v":0},0,{"$f":"E130-F130","v":0},null,null,{"$f":"G130","v":0},{"$f":"G130-J130","v":0},{"$f":"J133","v":0}]
[null,"1 PUAN İNDİRİMLİ ORANA TABİ KISIM  (İMALAT)",{"$f":"E93","v":0},{"$f":"C131*C129","v":0},{"$f":"D131*$H$94","v":0},{"$f":"D131/100","v":0},{"$f":"E131-F131","v":0},null,null,{"$f":"G131","v":0},{"$f":"G131-J131","v":0}]
[null,"5 PUAN İNDİRİMLİ ORANA TABİ KISIM  ( İHRACAT)",{"$f":"D93","v":0},{"$f":"C132*C129","v":0},{"$f":"D132*$H$94","v":0},{"$f":"D132/20","v":0},{"$f":"E132-F132","v":0},null,null,0,0]
[null,"TOPLAM",{"$f":"SUM(C130:C132)","v":0},{"$f":"SUM(D130:D132)","v":0},0,{"$f":"SUM(F130:F132)","v":0},{"$f":"SUM(G130:G132)","v":0},null,null,0,0]
[null,"TOPLAM KV MATRAHI VE ÖDENMESİ GEREKEN KV ",{"$f":"C104+C129+C109+C114+C119+C124","v":0},{"$f":"D108+D133+D113+D118+D123+D128","v":0},{"$f":"E108+E133+E113+E118+E123+E128","v":0},{"$f":"F108+F133+F113+F118+F123+F128","v":0},{"$f":"G108+G133+G113+G118+G123+G128","v":0},null,null,{"$f":"J108+J133+J113+J118+J123+J128","v":0},{"$f":"K133+K108+K113+K118+K123+K128","v":0},{"$f":"L105+L130+L110+L115+L120+L125","v":0}]
[]
[null,"GEÇİCİ VERGİ BEYANNMESİNDE MATRAH BİLDİRİMİ BÖLÜMÜNDE DOLDURULACAK KISIMLAR VE TUTARLARI"]
[null,"32 A Madde Kapsamında İndirimli Kurumlar Vergisine (Geçici Vergiye) Tabi Matrah",{"$f":"C104+C109+C114+C119+C124","v":0},{"$f":"E108+E113+E118+E123+E128","v":0},"1-5 Puan Olmasaydı Hesaplan KV Tutarı"]
[null,null,null,{"$f":"G108+G113+G118+G123++G128","v":0},"1 -5 Puan İndirim Sonrasında Ödenecek KV Tutarı\n (32 A olmasaydı hesaplanacak Vergi)"]
[null,null,null,{"$f":"K108+K113+K118+K123+K128","v":0},"32/A İndirimi ile Vazgeçilen Vergi"]
[null,"32 A Madde Kapsamında İndirimli Kurumlar Vergisi(Geçici Vergi) Oranı",{"$f":"IFERROR(D140/C137,0)","v":0},{"$f":"L105+L110+L115+L120+L125","v":0},"32/A ya Tabi Matrah Üzerinden Ödenecek KV"]
[null,"32/7 Madde Kapsamında İndirimli Kurumlar Vergisine (Geçici Vergiye) Tabi Matrah  (İhracat)",{"$f":"D132","v":0},{"$f":"E132","v":0},"5 Puan Olmasaydı Hesaplan KV Tutarı"]
[null,null,null,{"$f":"F132","v":0},"5 Puan İndirimin Vergi Etkisi "]
[null,"32/7 Madde Kapsamında İndirimli Kurumlar Vergisi (Geçici Vergi) Oranı",{"$f":"IFERROR(D143/C141,0)","v":0},{"$f":"G132","v":0},"5 Puan İndirim Sonrasında Ödenecek KV Tutarı (İhracat)\n"]
[null,"32/8 Madde Kapsamında İndirimli Kurumlar Vergisine (Geçici Vergiye) Tabi Matrah  (Üretim)",{"$f":"D131","v":0},{"$f":"E131","v":0},"1 Puan Olmasaydı Hesaplan KV Tutarı"]
[null,null,null,{"$f":"F131","v":0},"1 Puan İndirimin Vergi Etkisi "]
[null,"32/8 Madde Kapsamında İndirimli Kurumlar Vergisi (Geçici Vergi) Oranı",{"$f":"IFERROR(D146/C144,0)","v":0},{"$f":"G131","v":0},"1 Puan İndirim Sonrasında Ödenecek KV Tutarı (Üretim)\n"]
[null,"Genel Orana Tabi Matrah (Diğer)",{"$f":"D130","v":0},{"$f":"J130","v":0},"Diğer Faalilyetlerden Elde Edilen Kazanç"]
[null,null,{"$f":"IFERROR(D147/C147,0)","v":0}]
[null,"MATRAHLAR TOPLAMI",{"$f":"C137+C144+C141+C147","v":0},{"$f":"D140+D146+D143+D147","v":0}]

{"sheet":"BİST (32 6 İNDİRİMLİ)","index":2,"n_rows":149,"n_cols":14,"rows_kept":149,"cut":false,"hidden":false,"merged":[[135,1,135,4],[137,1,138,2],[87,6,101,7],[104,13,107,13],[109,13,112,13],[114,13,117,13],[119,13,122,13],[124,13,127,13],[128,9,133,10],[129,13,132,13],[85,2,85,6],[87,1,89,1],[87,2,88,2],[87,3,88,3],[87,4,88,4],[87,5,88,5],[84,2,84,6],[1,1,2,1],[59,1,59,2],[60,1,60,2],[71,1,72,1],[73,1,73,2],[74,1,74,2],[74,3,74,4],[75,1,75,2],[75,3,75,4],[79,1,79,3],[82,2,82,6]]}
[]
[null,"FAALİYET TÜRLERİ İTİBARİYLE HASILATLAR VE TOPLAM İÇİNDEKİ ORANLARI",{"$f":"IFERROR(C4/C4,0)","v":0},{"$f":"IFERROR(D4/C4,0)","v":0},{"$f":"IFERROR(E4/C4,0)","v":0},{"$f":"IFERROR(F4/C4,0)","v":0}]
[null,null,"Toplam Hasılat","İhracat faaliyeti","İmalat faaliyeti","Diğer faaliyetler"]
[null,"A-BRÜT SATIŞLAR (60)",{"$f":"D4+E4+F4","v":0},{"$f":"SUM(D5:D7)","v":0},{"$f":"SUM(E5:E7)","v":0},0]
[null,"1-Yurtiçi Satışlar (600)",{"$f":"D5+E5+F5","v":0}]
[null,"2-Yurtdışı Satışlar (601)",{"$f":"D6+E6+F6","v":0}]
[null,"3-Diğer Gelirler (602)",{"$f":"D7+E7+F7","v":0}]
[null,"B-SATIŞ İNDİRİMLERİ(-) (61)",{"$f":"SUM(C9:C11)","v":0},{"$f":"SUM(D9:D11)","v":0},{"$f":"SUM(E9:E11)","v":0},0]
[null,"1-Satıştan İadeler (-) (610)",{"$f":"SUM(D9:F9)","v":0}]
[null,"2- Satış İskontoları (-) (611)",{"$f":"SUM(D10:F10)","v":0}]
[null,"3-Diğer İndirimler (-) (612)",0]
[null,"C-NET SATIŞLAR",{"$f":"C4-C8","v":0},{"$f":"D4-D8","v":0},{"$f":"E4-E8","v":0},0]
[null,"D-SATIŞLARIN MALİYETİ (-) (62)",{"$f":"SUM(C14:C17)","v":0},{"$f":"SUM(D14:D17)","v":0},{"$f":"SUM(E14:E17)","v":0},{"$f":"SUM(F14:F17)","v":0}]
[null,"1-Satılan Mamuller Maliyeti ( 620)",{"$f":"SUM(D14:F14)","v":0}]
[null,"2-Satılan Ticari Mal Maliyeti (621)",{"$f":"SUM(D15:F15)","v":0}]
[null,"3-Satılan Hizmet Maliyeti (622)",0]
[null,"4-Diğer Satışların Maliyeti (623)",0]
[null,"BRÜT SATIŞ KARI / ZARARI",{"$f":"C12-C13","v":0},{"$f":"D12-D13","v":0},{"$f":"E12-E13","v":0},0]
[null,"E-FAALİYET GİDERLERİ (-) (63)",{"$f":"SUM(C20:C24)","v":0},{"$f":"SUM(D20:D24)","v":0},{"$f":"SUM(E20:E24)","v":0},0]
[null,"1-Araştırma ve Geliştirme Giderleri(-) (630)",{"$f":"SUM(D20:F20)","v":0}]
[null,"2-Pazarlama, Satış ve Dağıtım Giderleri(-) (631)",{"$f":"SUM(D21:F21)","v":0}]
[null,"3-Genel Yönetim Giderleri(-) (632)",{"$f":"SUM(D22:F22)","v":0}]
[null,"MÜŞTEREK GENEL GİDERLER (DAĞITIM-HASILAT PAYINA GÖRE)",null,{"$f":"C23*D2","v":0},{"$f":"C23*E2","v":0},{"$f":"C23*F2","v":0}]
[null,"MÜŞTEREK GENEL GİDER GİBİ DAĞITIMA TABİ TUTULACAK AMORTİSMAN GİDERLERİ  (DAĞITIM-HASILAT PAYINA GÖRE)",null,{"$f":"C24*D2","v":0},{"$f":"C24*E2","v":0},{"$f":"C24*F2","v":0}]
[null,"FAALİYET KARI / ZARARI ",{"$f":"C18-C19","v":0},{"$f":"D18-D19","v":0},{"$f":"E18-E19","v":0},0]
[null,"F-DİĞER FAALİYETLERDEN OLAĞAN GELİR VE KARLAR (64)",{"$f":"SUM(C27:C35)","v":0},{"$f":"SUM(D27:D35)","v":0},{"$f":"SUM(E27:E35)","v":0},{"$f":"SUM(F27:F35)","v":0}]
[null,"         1- İŞTİRAKLERDEN TEMETTÜ GELİRLERİ (640)",{"$f":"SUM(D27:F27)","v":0}]
[null,"         2- BAĞLI ORTAKLIKLARDAN TEMETTÜ GELİRLERİ (641)",{"$f":"SUM(D28:F28)","v":0}]
[null,"         3- FAİZ GELİRLERİ (642) (ihracat ve imalat kaynaklı alacağın tahsiline kadar olan süreçte oluşan)",0]
[null,"         4- KOMİSYON GELİRLERİ (643)",0]
[null,"         5- KONUSU OLMAYAN KARŞILIKLAR (644)",0]
[null,"         6- MENKUL KIYMET SATIŞ KARLARI (645)",0]
[null,"         7- KAMBİYO KARLARI (646) (ihracat ve imalat kaynaklı alacağın tahsiline kadar olan süreçte oluşan)",0]
[null,"         8- REESKONT FAİZ GELİRLERİ (647)",0]
[null,"         9- FAALİYETLE İLGİLİ DİĞER GELİR VE KARLAR (649)",0]
[null,"ARA TOPLAM",{"$f":"C25+C26","v":0},{"$f":"D25+D26","v":0},{"$f":"E25+E26","v":0},{"$f":"F25+F26","v":0}]
[null,"G-DİĞER FAALİYETLERDEN OLAĞAN GİDER VE ZARARLAR(-) (65)",{"$f":"SUM(C38:C43)","v":0},{"$f":"SUM(D38:D43)","v":0},{"$f":"SUM(E38:E43)","v":0},0]
[null,"         1- KOMİSYON GİDERLERİ (653)",{"$f":"SUM(D38:F38)","v":0}]
[null,"         2- KARŞILIK GİDERLERİ (654)",{"$f":"SUM(D39:F39)","v":0}]
[null,"         3- MENKUL KIYMET SATIŞ ZARARLARI (655)",0]
[null,"         4- KAMBİYO ZARARLARI (656) (ihracat ve imalat kaynaklı alacağın tahsiline kadar olan süreçte oluşan)",0]
[null,"         5- REESKONT FAİZ GİDERLERİ (657)",0]
[null,"         6- DİĞER OLAĞAN GİDER VE ZARARLAR (659)",{"$f":"SUM(D43:F43)","v":0}]
[null,"ARA TOPLAM",{"$f":"C36-C37","v":0},{"$f":"D36-D37","v":0},{"$f":"E36-E37","v":0},0]
[null,"H-FİNANSMAN GİDERLERİ(-) (66)",{"$f":"SUM(C46:C49)","v":0},{"$f":"SUM(D46:D49)","v":0},{"$f":"SUM(E46:E49)","v":0},{"$f":"SUM(F46:F49)","v":0}]
[null,"         1- KISA VADELİ BORÇLANMA GİDERLERİ (-)",{"$f":"SUM(D46:F46)","v":0}]
[null,"         2- UZUN VADELİ BORÇLANMA GİDERLERİ (-)",{"$f":"SUM(D47:F47)","v":0}]
[null,"         1- KISA VADELİ BORÇLANMA GİDERLERİ (-) (DAĞITIM)",null,{"$f":"C48*D2","v":0},{"$f":"C48*E2","v":0},{"$f":"C48*F2","v":0}]
[null,"         2- UZUN VADELİ BORÇLANMA GİDERLERİ (-) (DAĞITIM)",null,{"$f":"C49*D2","v":0},{"$f":"C49*E2","v":0},{"$f":"C49*F2","v":0}]
[null,"ARA TOPLAM",{"$f":"C44-C45","v":0},{"$f":"D44-D45","v":0},{"$f":"E44-E45","v":0},{"$f":"F44-F45","v":0}]
[null,"I-OLAĞANDIŞI GELİR VE KÂRLAR (67)",{"$f":"SUM(D51:F51)","v":0},{"$f":"SUM(D52:D53)","v":0},{"$f":"SUM(E52:E53)","v":0},{"$f":"SUM(F52:F53)","v":0}]
[null,"1- ÖNCEKİ DÖNEM GELİR VE KARLARI (671)",{"$f":"SUM(D52:F52)","v":0}]
[null,"2-DİĞER OLAĞAN DIŞI GELİR VE KARLAR (679)",{"$f":"SUM(D53:F53)","v":0}]
[null,"ARA TOPLAM",{"$f":"SUM(D54:F54)","v":0},{"$f":"D50+D51","v":0},{"$f":"E50+E51","v":0},0]
[null,"J-OLAĞANDIŞI GİDER VE ZARARLAR(-) (68)",{"$f":"SUM(C56:C58)","v":0},{"$f":"SUM(D56:D58)","v":0},{"$f":"SUM(E56:E58)","v":0},0]
[null,"1-Çalışmayan Kısım Gider ve Zararları(-) (680)",{"$f":"SUM(D56:F56)","v":0}]
[null,"2-Önceki Dönem Gider ve Zararları(-) (681)",{"$f":"SUM(D57:F57)","v":0}]
[null,"3-Diğer Olağan Dışı Gider ve Zararlar(-) (689)",0]
[null,"DÖNEM KÂRI VEYA ZARARI \n(TİCARİ BİLANÇO KARI ZARARI )",{"$f":"C54-C55","v":0},{"$f":"D54-D55","v":0},{"$f":"E54-E55","v":0},0]
[null,"İHRACAT, İMALAT VE DİĞER FAALİYETLERDEN ELDE EDİLEN KAZANCIN TOPLAM TİCARİ KAZANÇ İÇİNDEKİ PAYLARI  ",null,{"$f":"IF(D59>=$C$59,1,\n    IF(D59<=0,0,\n    IF(AND(D59>0,D59<$C$59),D59/$C$59)))","v":1},{"$f":"IF(E59>=$C$59,1,\n    IF(E59<=0,0,\n    IF(AND(E59>0,E59<$C$59),E59/$C$59)))","v":1},{"$f":"IF(F59>=$C$59,1,\n    IF(F59<=0,0,\n    IF(AND(F59>0,F59<$C$59),F59/$C$59)))","v":1}]
[null,"TOPLAM İÇİNDEKİ PAYI",null,{"$f":"D60/(D60+E60+F60)","v":0.33333333333333331},{"$f":"E60/(D60+E60+F60)","v":0.33333333333333331},{"$f":"F60/(D60+E60+F60)","v":0.33333333333333331}]
[]
[null,"KKEG +"]
[null," KABUL EDİLMEYEN GELİRLER -"]
[null,"ZARAR OLSA DAHİ İNDİRİLECEK İSTİSNALAR -",{"$f":"C66+C67+C68","v":0}]
[null,"Hizmet İhracatı Faaliyetinden (KVK 10-1/ğ) Elde Edilen Kazançlardan İstisna Edilenlerin Toplamı"]
[null,"İmalat Faaliyetinden Elde Edilen Kazançlardan İstisna Edilenlerin Toplamı"]
[null,"Diğer Faaliyetlerden Elde Edilen Kazançlardan İstisna Edilenlerin Toplamı"]
[null,"GEÇMİŞ YIL ZARARLARI -"]
[null,"İNDİRİMLER -",null,"AZAMİ YAZILABİLECEK İNDİRİMLER TUTARI",{"$f":"C59+C63-C64-C65-C69","v":0}]
[]
[null,"1 PUAN İNDİRİM UYGULANACAK TUTARIN HESABINDA İSTİSNA KAZANÇLAR DÜŞÜLDÜKTEN SONRA BULUNAN TİCARİ KAZANÇ TUTARI İLE  İHRACAT,İMALAT VE DİĞER KAZANÇLARIN TUTARI","TİCARİ KAZANÇ TAN İhracat ve İmalat Kazancından İstisna Olan Tutarlar Düşüldükten Sonra Kalan Tutarı","İhracat Faaliyetinden Elde Edilen  Kazançtan İstisna Olan Kısım Düşüldükten Sonra Bulunan Tutarı","Üretim  Faaliyetinden Elde Edilen  Kazançtan İstisna Olan Kısım Düşüldükten Sonra Bulunan Tutarı","Diğer Faaliyetinden Elde Edilen  Kazanç"]
[null,null,{"$f":"IF(C59-C66-C67<=0,0,C59-C66-C67)","v":0},{"$f":"IF($D$59-C66<=0,0,MIN($D$59-C66,$C$73*D61))","v":0},{"$f":"IF($E$59-C67<=0,0,MIN($E$59-C67,$C$73*E61))","v":0},{"$f":"IF(C73-D73-E73<=0,0,C73-D73-E73)","v":0}]
[null,"MATRAH DAĞITIM PAYLARI",null,{"$f":"IFERROR(IF(D73/C73<=0,0,D73/C73),0)","v":0},{"$f":"IFERROR(IF(E73/C73<=0,0,E73/C73),0)","v":0},{"$f":"IFERROR(F73/C73,0)","v":0}]
[null,"İHRACAT, İMALAT VE DİĞER FAALİYETLERDEN ELDE EDİLEN KAZANCIN TOPLAM TİCARİ KAZANÇ İÇİNDEKİ PAYLARI ",null,{"$f":"IFERROR(IF(AND(D73+E73>C73, F73<=0),1,(D73+E73)/C73),0)","v":0},null,{"$f":"IFERROR(IF(F73<=0,0,F73/C73),0)","v":0}]
[null,"NEGATİF VE % 100 DEN BÜYÜKLÜK KONTROLÜ SONRASINDAKİ PAYLARI",null,{"$f":"IFERROR(IF(D75<=0,0,IF(D75>1,1,D75)),0)","v":0},null,{"$f":"IFERROR(IF(F75<=0,0,IF(F75>1,1,F75)),0)","v":0}]
[]
[null,"SAFİ KURUM KAZANCI \n(KURUMLAR VERGİSİ MATRAHI)",{"$f":"C59+C63-C64-C65-C69-C70","v":0},{"$f":"IF(C78<0, \"ZARAR\",\"KAR\")","v":"KAR"}]
[]
[null,"2022 YILI 3. DÖNEM İNDİRİMLİ KURUMLAR VERGİSİ HESAPLAMA TABLOSU"]
[null,null,"1. TEŞVİK BELGESİ","2. TEŞVİK BELGESİ","3. TEŞVİK BELGESİ","4. TEŞVİK BELGESİ","5. TEŞVİK BELGESİ"]
[null,"Vergi İndirim Oranı (VİO)"]
[null,"KV MATRAHI (Safi Kurum Kazancı)",{"$f":"C78","v":0}]
[null,"32/A  Uygulanacak K.V. Matrahı (HER BİR TEŞVİK BELGESİ KAPSAMINDA YARARLANILABİLECEK YATIRIMA KATKI TUTARININ MATRAHI BU HÜCRELERE YAZILMALIDIR)",null,null,null,null,null,{"$f":"IF(SUM(C84:G84)>C78,\"32/A İNDİRİMİ UYGULANACAK KAZANÇ, SAFİ KURUM KAZANCINDAN FAZLADIR\",SUM(C84:G84))","v":0}]
[null,"32/A UYGULANMAYACAK K.V.  Matrahı",{"$f":"IF(C83-(C84+D84+E84+F84+G84)<0,0,C83-(C84+D84+E84+F84+G84))","v":0}]
[null,"MATRAH TOPLAMI",{"$f":"IF((C84+D84+E84+F84+G84+C85)>C78,C78,(C84+D84+E84+F84+G84+C85))","v":0}]
[]
[null,"SAFİ KURUM KAZANCININ  KV VERGİ ORANLARI İTİBARİYLE DAĞILIMI ","TOPLAM SAFİ KAZANÇ","İhracat Kazancı Payı","Üretim Kazancı Payı","Diğer Faaliyet Kazancı Payı","KVK 32/6 DA BELİRTİLEN ŞARTLARIN BULUNDUĞU  KABUL EDİLMİŞTİR. \n\n"]
[]
[null,null,{"$f":"C78","v":0},{"$f":"IF(AND(AND($D$59>0,($D$59+$E$59)>=$C$59,D59>=C66),$C$90>=MAX(D59,D73)),\n\nMIN(MAX(IF(D59<=C90,D59,IF(D73<=C90,D73)),$C$90*D74)),\n\nIF(OR(D59<=0,D73<=0),0,\n\nMIN( MAX(   MAX(   IF(D59<=C90,D59),  IF(D73<=C90,D73) ),    MIN($C$90*D74,D59,D73)),$C$90)))","v":0},{"$f":"MIN( IF(AND(AND($E$59>0,($D$59+$E$59)>=$C$59,E59>=C67),$C$90>=MAX(E59,E73)),\n\nMIN(MAX(IF(E59<=C90,E59,IF(E73<=C90,E73)),$C$90*E74)),\n\nIF(OR(E59<=0,E73<=0),0,\n\nMIN( MAX(   MAX(   IF(E59<=C90,E59),  IF(E73<=C90,E73) ),    MIN($C$90*E74,E59,E73)),$C$90))),C90-D90)","v":0},{"$f":"C90-D90-E90","v":0}]
[null,"SAFİ KURUM KAZANCININ DAĞILIMI ORANSAL DAĞILIMI",{"$f":"C90","v":0},{"$f":"IFERROR(D90/C90,0)","v":0},{"$f":"IFERROR(E90/D90,0)","v":0},{"$f":"IFERROR(F90/E90,0)","v":0}]
[null,"SAFİ KURUM KAZANCININ DAĞILIMI TUTARSAL",{"$f":"C91","v":0},{"$f":"D90","v":0},{"$f":"E90","v":0},{"$f":"F90","v":0}]
[null,"SAFİ KURUM KAZANCI DAĞILIMI",{"$f":"C92","v":0},{"$f":"IFERROR(IF(D92/C92>=1,1,D92/C92),0)","v":0},{"$f":"IFERROR(IF(E92/C92>=1,1,E92/C92),0)","v":0},{"$f":"IFERROR(IF(F92/C92>=1,1,F92/C92),0)","v":0},null,null,"KV ORANI"]
[null,"1 PUAN VE 32/A İNDİRİMİ OLMASAYDI HESAPLANAN KV TUTARI \n(32/6 UYGULANMIŞTIR)",{"$f":"C93*($I$94-2/100)","v":0},{"$f":"D92*($I$94-2/100)","v":0},{"$f":"E92*($I$94-2/100)","v":0},{"$f":"F92*($I$94-2/100)","v":0},null,null,0.25]
[null,"32/ A UYGULANAN MATRAH",{"$f":"C84+D84+E84+F84+G84","v":0},{"$f":"D107+D112+D117+D122+D127","v":0},{"$f":"D106+D111+D116+D121+D126","v":0},{"$f":"D105+D110+D115+D120+D125","v":0}]
[null,"32/A UYGULANACAK MATRAH ÜZERİNDEN ÖDENECEK KV TUTARI",{"$f":"L108+L113+L118+L123+L128","v":0},{"$f":"L107+L112+L117+L122+L127","v":0},{"$f":"L106+L111+L116+L121+L126","v":0},{"$f":"L105+L110+L115+L120+L125","v":0}]
[null,"32/A UYGULANMAYAN MATRAH",{"$f":"IF(C85<=0,0,C85)","v":0},{"$f":"D132","v":0},{"$f":"D131","v":0},{"$f":"D130","v":0}]
[null,"32/A UYGULANMAYAN MATRAH ÜZERİNDEN ÖDENECEK KV TUTARI",{"$f":"N130","v":0},{"$f":"L132","v":0},{"$f":"L131","v":0},{"$f":"L130","v":0}]
[null,"TOPLAM ÖDENECEK KV",{"$f":"C96+C98","v":0},{"$f":"L132+L107","v":0},{"$f":"L131+L106","v":0},{"$f":"L130+L105","v":0}]
[null,"TOPLAM AVANTAJ  (YARARLANILAN 1 PUAN İNDİRİMİ + 32/A İNDİRİMİ TUTARI )",{"$f":"C94-C99","v":0},{"$f":"D101+D102","v":0},{"$f":"E101+E102","v":0},0]
[null,"YARARLANILAN 1 - 5  PUAN İNDİRİMİ TUTARI",{"$f":"H133+H128+H123+H118+H113+H108","v":0},{"$f":"H132+H107+H112+H117+H122+H127","v":0},{"$f":"H131+H106+H111+H116+H121+H126","v":0},{"$f":"H130+H105+H110+H115+H120+H125","v":0}]
[null,"YARLANILAN 32/A İNDİRİMİ TUTARI",{"$f":"M108+M113+M118+M123+M128+M133","v":0},{"$f":"M107+M112+M122+M127+M132+M117","v":0},{"$f":"M106+M111+M116+M121+M126+M131","v":0},{"$f":"M105++M110+M115+M120+M125+M130","v":0}]
[]
[null,"32/A UYGULANABİLECEK MATRAH (1.TEŞVİK BELGESİ)",{"$f":"C84","v":0},"KV MATRAHI","32/6 VE 1 - 5 PUAN İNDİRİM OLMASAYDI HESAPLANAN KV TUTARI","32/6 NEDENİYLE HESAPLANAN İNDİRİM TUTAR","32/6 A İNDİRİMİ SONRASINDA HESAPLANAN KURUMLAR VERGİSİ TUTARI","1 - 5 Puan İndirim Tutarı","1 -5 Puan İndirim Sonrasında Hesaplanan KV Tutarı","32/A İndirimi Olmasaydı Ödenecek KV Tutarı","32/6 İndirimi  / 1 -5 Puan İndirim ve 32/A VİO Uygulandıktan Sonra Tatbik Edilecek KV Oranı","1 - 5 Puan İndirim ve 32/A İndirimi Uygulandıktan Sonra Ödenecek  KV Tutarı","Yararlanılan Yatırıma Katkı Tutarı\n(32/A İnd. KV Nedeniyle Vazgeçilen Vergi Tutarı)","Ödenecek KV Tutarı"]
[null,"GENEL ORANA TABİ KISIM (DİĞER FAALİYETLER)",{"$f":"F93","v":0},{"$f":"C104*C105","v":0},{"$f":"D105*$I$94","v":0},{"$f":"D105*0.02","v":0},{"$f":"E105-F105","v":0},0,{"$f":"E105-H105-F105","v":0},{"$f":"I105","v":0},{"$f":"($I$94-0.02)-(($I$94-0.02)*C82)","v":0.23},{"$f":"K105*D105","v":0},{"$f":"J105-L105","v":0},{"$f":"L108","v":0}]
[null,"1 PUAN İNDİRİMLİ ORANA TABİ KISIM  (İMALAT)",{"$f":"E93","v":0},{"$f":"C104*C106","v":0},{"$f":"D106*$I$94","v":0},{"$f":"D106*0.02","v":0},{"$f":"E106-F106","v":0},{"$f":"D106/100","v":0},{"$f":"E106-H106-F106","v":0},{"$f":"I106","v":0},{"$f":"($I$94-0.03)-(($I$94-0.03)*C82)","v":0.22},{"$f":"K106*D106","v":0},{"$f":"J106-L106","v":0}]
[null,"5 PUAN İNDİRİMLİ ORANA TABİ KISIM  ( İHRACAT)",{"$f":"D93","v":0},{"$f":"C104*C107","v":0},{"$f":"D107*$I$94","v":0},0,0,{"$f":"D107/20","v":0},{"$f":"E107-H107-F107","v":0},0,{"$f":"($I$94-0.07)-(($I$94-0.07)*C82)","v":0.18},{"$f":"K107*D107","v":0},0]
[null,"TOPLAM",{"$f":"SUM(C105:C107)","v":0},{"$f":"SUM(D105:D107)","v":0},0,0,0,{"$f":"SUM(H105:H107)","v":0},{"$f":"SUM(I105:I107)","v":0},{"$f":"SUM(J105:J107)","v":0},null,0,0]
[null,"32/A UYGULANABİLECEK MATRAH (2.TEŞVİK BELGESİ)",{"$f":"D84","v":0},"KV MATRAHI","32/6 VE 1-5 PUAN İNDİRİM OLMASAYDI HESAPLANAN KV TUTARI","32/6 NEDENİYLE HESAPLANAN İNDİRİM TUTAR","32/6 A İNDİRİMİ SONRASINDA HESAPLANAN KURUMLAR VERGİSİ TUTARI","1 - 5 Puan İndirim Tutarı","1 -5 Puan İndirim Sonrasında Hesaplanan KV Tutarı","32/A İndirimi Olmasaydı Ödenecek KV Tutarı","32/6 İndirimi  / 1 - 5 Puan İndirim ve 32/A VİO Uygulandıktan Sonra Tatbik Edilecek KV Oranı","1 -5 Puan İndirim ve 32/A İndirimi Uygulandıktan Sonra Ödenecek  KV Tutarı","Yararlanılan Yatırıma Katkı Tutarı\n(32/A İnd. KV Nedeniyle Vazgeçilen Vergi Tutarı)","Ödenecek KV Tutarı"]
[null,"GENEL ORANA TABİ KISIM (DİĞER FAALİYETLER)",{"$f":"F93","v":0},{"$f":"C109*C110","v":0},{"$f":"D110*$I$94","v":0},{"$f":"D110*0.02","v":0},{"$f":"E110-F110","v":0},0,{"$f":"E110-H110-F110","v":0},{"$f":"I110","v":0},{"$f":"($I$94-0.02)-(($I$94-0.02)*D82)","v":0.23},{"$f":"K110*D110","v":0},{"$f":"J110-L110","v":0},{"$f":"L113","v":0}]
[null,"1 PUAN İNDİRİMLİ ORANA TABİ KISIM  (İMALAT)",{"$f":"E93","v":0},{"$f":"C109*C111","v":0},{"$f":"D111*$I$94","v":0},{"$f":"D111*0.02","v":0},{"$f":"E111-F111","v":0},{"$f":"D111/100","v":0},{"$f":"E111-H111-F111","v":0},{"$f":"I111","v":0},{"$f":"($I$94-0.03)-(($I$94-0.03)*D82)","v":0.22},{"$f":"K111*D111","v":0},{"$f":"J111-L111","v":0}]
[null,"5 PUAN İNDİRİMLİ ORANA TABİ KISIM  ( İHRACAT)",{"$f":"D93","v":0},{"$f":"C109*C112","v":0},{"$f":"D112*$I$94","v":0},0,0,{"$f":"D112/20","v":0},{"$f":"E112-H112-F112","v":0},0,{"$f":"($I$94-0.07)-(($I$94-0.07)*D82)","v":0.18},{"$f":"K112*D112","v":0},0]
[null,"TOPLAM",{"$f":"SUM(C110:C112)","v":0},0,0,0,0,{"$f":"SUM(H110:H112)","v":0},{"$f":"SUM(I110:I112)","v":0},{"$f":"SUM(J110:J112)","v":0},null,{"$f":"SUM(L110:L112)","v":0},0]
[null,"32/A UYGULANABİLECEK MATRAH (3.TEŞVİK BELGESİ)",{"$f":"E84","v":0},"KV MATRAHI","32/6 VE 1 - 5 PUAN İNDİRİM OLMASAYDI HESAPLANAN KV TUTARI","32/6 NEDENİYLE HESAPLANAN İNDİRİM TUTAR","32/6 A İNDİRİMİ SONRASINDA HESAPLANAN KURUMLAR VERGİSİ TUTARI","1 - 5 Puan İndirim Tutarı","1 -5 Puan İndirim Sonrasında Hesaplanan KV Tutarı","32/A İndirimi Olmasaydı Ödenecek KV Tutarı","32/6 İndirimi  / 1 -5 Puan İndirim ve 32/A VİO Uygulandıktan Sonra Tatbik Edilecek KV Oranı","1 - 5 Puan İndirim ve 32/A İndirimi Uygulandıktan Sonra Ödenecek  KV Tutarı","Yararlanılan Yatırıma Katkı Tutarı\n(32/A İnd. KV Nedeniyle Vazgeçilen Vergi Tutarı)","Ödenecek KV Tutarı"]
[null,"GENEL ORANA TABİ KISIM (DİĞER FAALİYETLER)",{"$f":"F93","v":0},{"$f":"C114*C115","v":0},{"$f":"D115*$I$94","v":0},{"$f":"D115*0.02","v":0},{"$f":"E115-F115","v":0},0,{"$f":"E115-H115-F115","v":0},{"$f":"I115","v":0},{"$f":"($I$94-0.02)-(($I$94-0.02)*E82)","v":0.23},{"$f":"K115*D115","v":0},{"$f":"J115-L115","v":0},{"$f":"L118","v":0}]
[null,"1 PUAN İNDİRİMLİ ORANA TABİ KISIM  (İMALAT)",{"$f":"E93","v":0},{"$f":"C114*C116","v":0},{"$f":"D116*$I$94","v":0},{"$f":"D116*0.02","v":0},{"$f":"E116-F116","v":0},{"$f":"D116/100","v":0},{"$f":"E116-H116-F116","v":0},{"$f":"I116","v":0},{"$f":"($I$94-0.03)-(($I$94-0.03)*E82)","v":0.22},{"$f":"K116*D116","v":0},{"$f":"J116-L116","v":0}]
[null,"5 PUAN İNDİRİMLİ ORANA TABİ KISIM  ( İHRACAT)",{"$f":"D93","v":0},{"$f":"C114*C117","v":0},{"$f":"D117*$I$94","v":0},0,0,{"$f":"D117/20","v":0},{"$f":"E117-H117-F117","v":0},0,{"$f":"($I$94-0.07)-(($I$94-0.07)*E82)","v":0.18},{"$f":"K117*D117","v":0},0]
[null,"TOPLAM",{"$f":"SUM(C115:C117)","v":0},0,0,0,0,{"$f":"SUM(H115:H117)","v":0},{"$f":"SUM(I115:I117)","v":0},{"$f":"SUM(J115:J117)","v":0},null,{"$f":"SUM(L115:L117)","v":0},0]
[null,"32/A UYGULANABİLECEK MATRAH (4. TEŞVİK BELGESİ)",{"$f":"F84","v":0},"KV MATRAHI","32/6 VE 1-5 PUAN İNDİRİM OLMASAYDI HESAPLANAN KV TUTARI","32/6 NEDENİYLE HESAPLANAN İNDİRİM TUTAR","32/6 A İNDİRİMİ SONRASINDA HESAPLANAN KURUMLAR VERGİSİ TUTARI","1 - 5 Puan İndirim Tutarı","1 -5 Puan İndirim Sonrasında Hesaplanan KV Tutarı","32/A İndirimi Olmasaydı Ödenecek KV Tutarı","32/6 İndirimi  / 1 - 5 Puan İndirim ve 32/A VİO Uygulandıktan Sonra Tatbik Edilecek KV Oranı","1 -5 Puan İndirim ve 32/A İndirimi Uygulandıktan Sonra Ödenecek  KV Tutarı","Yararlanılan Yatırıma Katkı Tutarı\n(32/A İnd. KV Nedeniyle Vazgeçilen Vergi Tutarı)","Ödenecek KV Tutarı"]
[null,"GENEL ORANA TABİ KISIM (DİĞER FAALİYETLER)",{"$f":"F93","v":0},{"$f":"C119*C120","v":0},{"$f":"D120*$I$94","v":0},{"$f":"D120*0.02","v":0},{"$f":"E120-F120","v":0},0,{"$f":"E120-H120-F120","v":0},{"$f":"I120","v":0},{"$f":"($I$94-0.02)-(($I$94-0.02)*F82)","v":0.23},{"$f":"K120*D120","v":0},{"$f":"J120-L120","v":0},{"$f":"L123","v":0}]
[null,"1 PUAN İNDİRİMLİ ORANA TABİ KISIM  (İMALAT)",{"$f":"E93","v":0},{"$f":"C119*C121","v":0},{"$f":"D121*$I$94","v":0},{"$f":"D121*0.02","v":0},{"$f":"E121-F121","v":0},{"$f":"D121/100","v":0},{"$f":"E121-H121-F121","v":0},{"$f":"I121","v":0},{"$f":"($I$94-0.03)-(($I$94-0.03)*F82)","v":0.22},{"$f":"K121*D121","v":0},{"$f":"J121-L121","v":0}]
[null,"5 PUAN İNDİRİMLİ ORANA TABİ KISIM  ( İHRACAT)",{"$f":"D93","v":0},{"$f":"C119*C122","v":0},{"$f":"D122*$I$94","v":0},0,0,{"$f":"D122/20","v":0},{"$f":"E122-H122-F122","v":0},0,{"$f":"($I$94-0.07)-(($I$94-0.07)*F82)","v":0.18},{"$f":"K122*D122","v":0},0]
[null,"TOPLAM",{"$f":"SUM(C120:C122)","v":0},0,0,0,0,{"$f":"SUM(H120:H122)","v":0},{"$f":"SUM(I120:I122)","v":0},{"$f":"SUM(J120:J122)","v":0},null,{"$f":"SUM(L120:L122)","v":0},0]
[null,"32/A UYGULANABİLECEK MATRAH (5.TEŞVİK BELGESİ)",{"$f":"G84","v":0},"KV MATRAHI","32/6 VE 1 - 5 PUAN İNDİRİM OLMASAYDI HESAPLANAN KV TUTARI","32/6 NEDENİYLE HESAPLANAN İNDİRİM TUTAR","32/6 A İNDİRİMİ SONRASINDA HESAPLANAN KURUMLAR VERGİSİ TUTARI","1 - 5 Puan İndirim Tutarı","1 -5 Puan İndirim Sonrasında Hesaplanan KV Tutarı","32/A İndirimi Olmasaydı Ödenecek KV Tutarı","32/6 İndirimi  / 1 -5 Puan İndirim ve 32/A VİO Uygulandıktan Sonra Tatbik Edilecek KV Oranı","1 - 5 Puan İndirim ve 32/A İndirimi Uygulandıktan Sonra Ödenecek  KV Tutarı","Yararlanılan Yatırıma Katkı Tutarı\n(32/A İnd. KV Nedeniyle Vazgeçilen Vergi Tutarı)","Ödenecek KV Tutarı"]
[null,"GENEL ORANA TABİ KISIM (DİĞER FAALİYETLER)",{"$f":"F93","v":0},{"$f":"C124*C125","v":0},{"$f":"D125*$I$94","v":0},{"$f":"D125*0.02","v":0},{"$f":"E125-F125","v":0},0,{"$f":"E125-H125-F125","v":0},{"$f":"I125","v":0},{"$f":"($I$94-0.02)-(($I$94-0.02)*F82)","v":0.23},{"$f":"K125*D125","v":0},{"$f":"J125-L125","v":0},{"$f":"L128","v":0}]
[null,"1 PUAN İNDİRİMLİ ORANA TABİ KISIM  (İMALAT)",{"$f":"E93","v":0},{"$f":"C124*C126","v":0},{"$f":"D126*$I$94","v":0},{"$f":"D126*0.02","v":0},{"$f":"E126-F126","v":0},{"$f":"D126/100","v":0},{"$f":"E126-H126-F126","v":0},{"$f":"I126","v":0},{"$f":"($I$94-0.03)-(($I$94-0.03)*G82)","v":0.22},{"$f":"K126*D126","v":0},{"$f":"J126-L126","v":0}]
[null,"5 PUAN İNDİRİMLİ ORANA TABİ KISIM  ( İHRACAT)",{"$f":"D93","v":0},{"$f":"C124*C127","v":0},{"$f":"D127*$I$94","v":0},0,0,{"$f":"D127/20","v":0},{"$f":"E127-H127-F127","v":0},0,{"$f":"($I$94-0.07)-(($I$94-0.07)*G82)","v":0.18},{"$f":"K127*D127","v":0},0]
[null,"TOPLAM",{"$f":"SUM(C125:C127)","v":0},0,0,0,0,{"$f":"SUM(H125:H127)","v":0},{"$f":"SUM(I125:I127)","v":0},{"$f":"SUM(J125:J127)","v":0},null,{"$f":"SUM(L125:L127)","v":0},0]
[null,"32/A UYGULANAMAYACAK MATRAH",{"$f":"IF(C85<=0,0,C85)","v":0},"KV MATRAHI","32/6 VE 1-5 PUAN İNDİRİM OLMASAYDI HESAPLANAN KV TUTARI","32/6 NEDENİYLE HESAPLANAN İNDİRİM TUTAR","32/6 A İNDİRİMİ SONRASINDA HESAPLANAN KURUMLAR VERGİSİ TUTARI","1 - 5 Puan İndirim Tutarı","1 -5 Puan İndirim Sonrasında Hesaplanan KV Tutarı","32/A İNDİRİMİ UYGULANMAZ",null,"1 Puan İndirim ve 32/A İndirimi Uygulandıktan Sonra Ödenecek  KV Tutarı","Yararlanılan Yatırıma Katkı Tutarı\n(32/A İnd. KV Nedeniyle Vazgeçilen Vergi Tutarı)","Ödenecek KV Tutarı"]
[null,"GENEL ORANA TABİ KISIM (DİĞER FAALİYETLER)",{"$f":"F93","v":0},{"$f":"C129*C130","v":0},{"$f":"D130*$I$94","v":0},{"$f":"D130*0.02","v":0},{"$f":"E130-F130","v":0},0,{"$f":"E130-H130-F130","v":0},null,null,{"$f":"I130","v":0},0,{"$f":"L133","v":0}]
[null,"1 PUAN İNDİRİMLİ ORANA TABİ KISIM  (İMALAT)",{"$f":"E93","v":0},{"$f":"C131*C129","v":0},{"$f":"D131*$I$94","v":0},{"$f":"D131*0.02","v":0},{"$f":"E131-F131","v":0},{"$f":"D131/100","v":0},{"$f":"E131-H131-F131","v":0},null,null,{"$f":"I131","v":0},0]
[null,"5 PUAN İNDİRİMLİ ORANA TABİ KISIM  ( İHRACAT)",{"$f":"D93","v":0},{"$f":"C132*C129","v":0},{"$f":"D132*$I$94","v":0},0,0,{"$f":"D132/20","v":0},{"$f":"E132-H132-F132","v":0},null,null,0,0]
[null,"TOPLAM",{"$f":"SUM(C130:C132)","v":0},{"$f":"SUM(D130:D132)","v":0},0,{"$f":"SUM(F130:F132)","v":0},0,{"$f":"SUM(H130:H132)","v":0},{"$f":"SUM(I130:I132)","v":0},null,null,0,{"$f":"SUM(M130:M132)","v":0}]
[null,"TOPLAM KV MATRAHI VE ÖDENMESİ GEREKEN KV ",{"$f":"C104+C129+C109+C114+C119+C124","v":0},{"$f":"D108+D133+D113+D118+D123+D128","v":0},0,0,0,0,0,null,null,{"$f":"L108+L133+L113+L118+L123+L128","v":0},{"$f":"M133+M108+M113+M118+M123+M128","v":0},{"$f":"N105+N130+N110+N115+N120+N125","v":0}]
[]
[null,"GEÇİCİ VERGİ BEYANNMESİNDE MATRAH BİLDİRİMİ BÖLÜMÜNDE DOLDURULACAK KISIMLAR VE TUTARLARI"]
[null,"32 A Madde Kapsamında İndirimli Kurumlar Vergisine (Geçici Vergiye) Tabi Matrah",{"$f":"C104+C109+C114+C119+C124","v":0},{"$f":"E108+E113+E118+E123+E128","v":0},"1-5 Puan Olmasaydı Hesaplan KV Tutarı"]
[null,null,null,{"$f":"I108+I113+I118+I123++I128","v":0}," 1 -5 Puan İndirim Sonrasında Ödenecek KV Tutarı\n (32 A olmasaydı hesaplanacak Vergi)"]
[null,null,null,{"$f":"M108+M113+M118+M123+M128","v":0},"32/A İndirimi ile Vazgeçilen Vergi"]
[null,"32 A Madde Kapsamında İndirimli Kurumlar Vergisi(Geçici Vergi) Oranı",{"$f":"IFERROR(D140/C137,0)","v":0},{"$f":"N105+N110+N115+N120+N125","v":0},"32/A ya Tabi Matrah Üzerinden Ödenecek KV"]
[null,"32/7 Madde Kapsamında İndirimli Kurumlar Vergisine (Geçici Vergiye) Tabi Matrah  (İhracat)",{"$f":"D132","v":0},{"$f":"G132","v":0},"5  Puan Olmasaydı Hesaplan KV Tutarı"]
[null,null,null,{"$f":"H132","v":0},"5 Puan İndirimin Vergi Etkisi "]
[null,"32/7 Madde Kapsamında İndirimli Kurumlar Vergisi (Geçici Vergi) Oranı",{"$f":"IFERROR(D143/C141,0)","v":0},{"$f":"I132","v":0},"5 Puan İndirim Sonrasında Ödenecek KV Tutarı (İhracat)\n"]
[null,"32/8 Madde Kapsamında İndirimli Kurumlar Vergisine (Geçici Vergiye) Tabi Matrah  (Üretim)",{"$f":"D131","v":0},{"$f":"G131","v":0},"1 Puan Olmasaydı Hesaplan KV Tutarı"]
[null,null,null,{"$f":"H131","v":0},"1 Puan İndirimin Vergi Etkisi "]
[null,"32/8 Madde Kapsamında İndirimli Kurumlar Vergisi (Geçici Vergi) Oranı",{"$f":"IFERROR(D146/C144,0)","v":0},{"$f":"I131","v":0},"1 Puan İndirim Sonrasında Ödenecek KV Tutarı (Üretim)\n"]
[null,"Genel Orana Tabi Matrah (Diğer)",{"$f":"D130","v":0},{"$f":"L130","v":0},"Diğer Faalilyetlerden Elde Edilen Kazanç"]
[null,null,{"$f":"IFERROR(D147/C147,0)","v":0}]
[null,"MATRAHLAR TOPLAMI",{"$f":"C137+C144+C141+C147","v":0},{"$f":"D140+D146+D143+D147","v":0}]

{"sheet":"İ Ö 2","index":3,"n_rows":149,"n_cols":12,"rows_kept":149,"cut":false,"hidden":true,"merged":[[84,2,84,6],[1,1,2,1],[59,1,59,2],[60,1,60,2],[71,1,72,1],[73,1,73,2],[74,1,74,2],[74,3,74,4],[75,1,75,2],[75,3,75,4],[79,1,79,3],[82,2,82,6],[85,2,85,6],[87,1,89,1],[87,2,88,2],[87,3,88,3],[87,4,88,4],[87,5,88,5],[135,1,135,4],[137,1,138,2],[104,11,107,11],[109,11,112,11],[114,11,117,11],[119,11,122,11],[124,11,127,11],[128,7,133,8],[129,11,132,11]]}
[]
[null,"FAALİYET TÜRLERİ İTİBARİYLE HASILATLAR VE TOPLAM İÇİNDEKİ ORANLARI",{"$f":"IFERROR(C4/C4,0)","v":1},{"$f":"IFERROR(D4/C4,0)","v":0.6},{"$f":"IFERROR(E4/C4,0)","v":0},{"$f":"IFERROR(F4/C4,0)","v":0.4}]
[null,null,"Toplam Hasılat","İhracat faaliyeti","İmalat faaliyeti","Diğer faaliyetler"]
[null,"A-BRÜT SATIŞLAR (60)",{"$f":"D4+E4+F4","v":2000000},{"$f":"SUM(D5:D7)","v":1200000},{"$f":"SUM(E5:E7)","v":0},800000]
[null,"1-Yurtiçi Satışlar (600)",{"$f":"D5+E5+F5","v":800000},null,null,800000]
[null,"2-Yurtdışı Satışlar (601)",{"$f":"D6+E6+F6","v":1200000},1200000]
[null,"3-Diğer Gelirler (602)",{"$f":"D7+E7+F7","v":0}]
[null,"B-SATIŞ İNDİRİMLERİ(-) (61)",{"$f":"SUM(C9:C11)","v":0},{"$f":"SUM(D9:D11)","v":0},{"$f":"SUM(E9:E11)","v":0},0]
[null,"1-Satıştan İadeler (-) (610)",{"$f":"SUM(D9:F9)","v":0}]
[null,"2- Satış İskontoları (-) (611)",{"$f":"SUM(D10:F10)","v":0}]
[null,"3-Diğer İndirimler (-) (612)",0]
[null,"C-NET SATIŞLAR",{"$f":"C4-C8","v":2000000},{"$f":"D4-D8","v":1200000},{"$f":"E4-E8","v":0},800000]
[null,"D-SATIŞLARIN MALİYETİ (-) (62)",{"$f":"SUM(C14:C17)","v":0},{"$f":"SUM(D14:D17)","v":0},{"$f":"SUM(E14:E17)","v":0},{"$f":"SUM(F14:F17)","v":0}]
[null,"1-Satılan Mamuller Maliyeti ( 620)",{"$f":"SUM(D14:F14)","v":0}]
[null,"2-Satılan Ticari Mal Maliyeti (621)",{"$f":"SUM(D15:F15)","v":0}]
[null,"3-Satılan Hizmet Maliyeti (622)",0]
[null,"4-Diğer Satışların Maliyeti (623)",0]
[null,"BRÜT SATIŞ KARI / ZARARI",{"$f":"C12-C13","v":2000000},{"$f":"D12-D13","v":1200000},{"$f":"E12-E13","v":0},800000]
[null,"E-FAALİYET GİDERLERİ (-) (63)",{"$f":"SUM(C20:C24)","v":0},{"$f":"SUM(D20:D24)","v":0},{"$f":"SUM(E20:E24)","v":0},0]
[null,"1-Araştırma ve Geliştirme Giderleri(-) (630)",{"$f":"SUM(D20:F20)","v":0}]
[null,"2-Pazarlama, Satış ve Dağıtım Giderleri(-) (631)",{"$f":"SUM(D21:F21)","v":0}]
[null,"3-Genel Yönetim Giderleri(-) (632)",{"$f":"SUM(D22:F22)","v":0}]
[null,"MÜŞTEREK GENEL GİDERLER (DAĞITIM-HASILAT PAYINA GÖRE)",null,{"$f":"C23*D2","v":0},{"$f":"C23*E2","v":0},{"$f":"C23*F2","v":0}]
[null,"MÜŞTEREK GENEL GİDER GİBİ DAĞITIMA TABİ TUTULACAK AMORTİSMAN GİDERLERİ  (DAĞITIM-HASILAT PAYINA GÖRE)",null,{"$f":"C24*D2","v":0},{"$f":"C24*E2","v":0},{"$f":"C24*F2","v":0}]
[null,"FAALİYET KARI / ZARARI ",{"$f":"C18-C19","v":2000000},{"$f":"D18-D19","v":1200000},{"$f":"E18-E19","v":0},800000]
[null,"F-DİĞER FAALİYETLERDEN OLAĞAN GELİR VE KARLAR (64)",{"$f":"SUM(C27:C35)","v":0},{"$f":"SUM(D27:D35)","v":0},{"$f":"SUM(E27:E35)","v":0},{"$f":"SUM(F27:F35)","v":0}]
[null,"         1- İŞTİRAKLERDEN TEMETTÜ GELİRLERİ (640)",{"$f":"SUM(D27:F27)","v":0}]
[null,"         2- BAĞLI ORTAKLIKLARDAN TEMETTÜ GELİRLERİ (641)",{"$f":"SUM(D28:F28)","v":0}]
[null,"         3- FAİZ GELİRLERİ (642) (ihracat ve imalat kaynaklı alacağın tahsiline kadar olan süreçte oluşan)",0]
[null,"         4- KOMİSYON GELİRLERİ (643)",0]
[null,"         5- KONUSU OLMAYAN KARŞILIKLAR (644)",0]
[null,"         6- MENKUL KIYMET SATIŞ KARLARI (645)",0]
[null,"         7- KAMBİYO KARLARI (646) (ihracat ve imalat kaynaklı alacağın tahsiline kadar olan süreçte oluşan)",0]
[null,"         8- REESKONT FAİZ GELİRLERİ (647)",0]
[null,"         9- FAALİYETLE İLGİLİ DİĞER GELİR VE KARLAR (649)",0]
[null,"ARA TOPLAM",{"$f":"C25+C26","v":2000000},{"$f":"D25+D26","v":1200000},{"$f":"E25+E26","v":0},{"$f":"F25+F26","v":800000}]
[null,"G-DİĞER FAALİYETLERDEN OLAĞAN GİDER VE ZARARLAR(-) (65)",{"$f":"SUM(C38:C43)","v":0},{"$f":"SUM(D38:D43)","v":0},{"$f":"SUM(E38:E43)","v":0},0]
[null,"         1- KOMİSYON GİDERLERİ (653)",{"$f":"SUM(D38:F38)","v":0}]
[null,"         2- KARŞILIK GİDERLERİ (654)",{"$f":"SUM(D39:F39)","v":0}]
[null,"         3- MENKUL KIYMET SATIŞ ZARARLARI (655)",0]
[null,"         4- KAMBİYO ZARARLARI (656) (ihracat ve imalat kaynaklı alacağın tahsiline kadar olan süreçte oluşan)",0]
[null,"         5- REESKONT FAİZ GİDERLERİ (657)",0]
[null,"         6- DİĞER OLAĞAN GİDER VE ZARARLAR (659)",{"$f":"SUM(D43:F43)","v":0}]
[null,"ARA TOPLAM",{"$f":"C36-C37","v":2000000},{"$f":"D36-D37","v":1200000},{"$f":"E36-E37","v":0},800000]
[null,"H-FİNANSMAN GİDERLERİ(-) (66)",{"$f":"SUM(C46:C49)","v":0},{"$f":"SUM(D46:D49)","v":0},{"$f":"SUM(E46:E49)","v":0},{"$f":"SUM(F46:F49)","v":0}]
[null,"         1- KISA VADELİ BORÇLANMA GİDERLERİ (-)",{"$f":"SUM(D46:F46)","v":0}]
[null,"         2- UZUN VADELİ BORÇLANMA GİDERLERİ (-)",{"$f":"SUM(D47:F47)","v":0}]
[null,"         1- KISA VADELİ BORÇLANMA GİDERLERİ (-) (DAĞITIM)",null,{"$f":"C48*D2","v":0},{"$f":"C48*E2","v":0},{"$f":"C48*F2","v":0}]
[null,"         2- UZUN VADELİ BORÇLANMA GİDERLERİ (-) (DAĞITIM)",null,{"$f":"C49*D2","v":0},{"$f":"C49*E2","v":0},{"$f":"C49*F2","v":0}]
[null,"ARA TOPLAM",{"$f":"C44-C45","v":2000000},{"$f":"D44-D45","v":1200000},{"$f":"E44-E45","v":0},{"$f":"F44-F45","v":800000}]
[null,"I-OLAĞANDIŞI GELİR VE KÂRLAR (67)",{"$f":"SUM(D51:F51)","v":0},{"$f":"SUM(D52:D53)","v":0},{"$f":"SUM(E52:E53)","v":0},{"$f":"SUM(F52:F53)","v":0}]
[null,"1- ÖNCEKİ DÖNEM GELİR VE KARLARI (671)",{"$f":"SUM(D52:F52)","v":0}]
[null,"2-DİĞER OLAĞAN DIŞI GELİR VE KARLAR (679)",{"$f":"SUM(D53:F53)","v":0}]
[null,"ARA TOPLAM",{"$f":"SUM(D54:F54)","v":2000000},{"$f":"D50+D51","v":1200000},{"$f":"E50+E51","v":0},800000]
[null,"J-OLAĞANDIŞI GİDER VE ZARARLAR(-) (68)",{"$f":"SUM(C56:C58)","v":0},{"$f":"SUM(D56:D58)","v":0},{"$f":"SUM(E56:E58)","v":0},0]
[null,"1-Çalışmayan Kısım Gider ve Zararları(-) (680)",{"$f":"SUM(D56:F56)","v":0}]
[null,"2-Önceki Dönem Gider ve Zararları(-) (681)",{"$f":"SUM(D57:F57)","v":0}]
[null,"3-Diğer Olağan Dışı Gider ve Zararlar(-) (689)",0]
[null,"DÖNEM KÂRI VEYA ZARARI \n(TİCARİ BİLANÇO KARI ZARARI )",{"$f":"C54-C55","v":2000000},{"$f":"D54-D55","v":1200000},{"$f":"E54-E55","v":0},800000]
[null,"İHRACAT, İMALAT VE DİĞER FAALİYETLERDEN ELDE EDİLEN KAZANCIN TOPLAM TİCARİ KAZANÇ İÇİNDEKİ PAYLARI  \n\n(Kazançlar arasında Öncelik İhracat Kazancına Verilmiştir. İhrcat Kazancından arta kalan Ticari Kazanç İmalat ve Diğer Faaliyetlere Sayılmıştır.)\n\n",null,{"$f":"IF(D59>=$C$59,1,\n    IF(D59<=0,0,\n    IF(AND(D59>0,D59<$C$59),D59/$C$59)))","v":0.6},{"$f":"IF(E59>=$C$59,1,\n    IF(E59<=0,0,\n    IF(AND(E59>0,E59<$C$59),E59/$C$59)))","v":0},{"$f":"IF(F59>=$C$59,1,\n    IF(F59<=0,0,\n    IF(AND(F59>0,F59<$C$59),F59/$C$59)))","v":0.4}]
[null,null,null,{"$f":"D60/(D60+E60+F60)","v":0.6},{"$f":"E60/(D60+E60+F60)","v":0},{"$f":"F60/(D60+E60+F60)","v":0.4}]
[]
[null,"KKEG +",200000]
[null," KABUL EDİLMEYEN GELİRLER -"]
[null,"ZARAR OLSA DAHİ İNDİRİLECEK İSTİSNALAR -",{"$f":"C66+C67+C68","v":100000}]
[null,"Hizmet İhracatı Faaliyetinden (KVK 10-1/ğ) Elde Edilen Kazançlardan İstisna Edilenlerin Toplamı"]
[null,"İmalat Faaliyetinden Elde Edilen Kazançlardan İstisna Edilenlerin Toplamı"]
[null,"Diğer Faaliyetlerden Elde Edilen Kazançlardan İstisna Edilenlerin Toplamı",100000]
[null,"GEÇMİŞ YIL ZARARLARI -"]
[null,"İNDİRİMLER -",100000,"AZAMİ YAZILABİLECEK İNDİRİMLER TUTARI",{"$f":"C59+C63-C64-C65-C69","v":2100000}]
[]
[null,"1 PUAN İNDİRİM UYGULANACAK TUTARIN HESABINDA İSTİSNA KAZANÇLAR DÜŞÜLDÜKTEN SONRA BULUNAN TİCARİ KAZANÇ TUTARI İLE  İHRACAT,İMALAT VE DİĞER KAZANÇLARIN TUTARI","TİCARİ KAZANÇ TAN İhracat ve İmalat Kazancından İstisna Olan Tutarlar Düşüldükten Sonra Kalan Tutarı","İhracat Faaliyetinden Elde Edilen  Kazançtan İstisna Olan Kısım Düşüldükten Sonra Bulunan Tutarı","Üretim  Faaliyetinden Elde Edilen  Kazançtan İstisna Olan Kısım Düşüldükten Sonra Bulunan Tutarı","Diğer Faaliyetinden Elde Edilen  Kazanç"]
[null,null,{"$f":"IF(C59-C66-C67<=0,0,C59-C66-C67)","v":2000000},{"$f":"IF($D$59-C66<=0,0,MIN($D$59-C66,$C$73*D61))","v":1200000},{"$f":"IF($E$59-C67<=0,0,MIN($E$59-C67,$C$73*E61))","v":0},{"$f":"IF(C73-D73-E73<=0,0,C73-D73-E73)","v":800000}]
[null,"MATRAH DAĞITIM PAYLARI",null,{"$f":"IFERROR(IF(D73/C73<=0,0,D73/C73),0)","v":0.6},{"$f":"IFERROR(IF(E73/C73<=0,0,E73/C73),0)","v":0},{"$f":"IFERROR(F73/C73,0)","v":0.4}]
[null,"İHRACAT, İMALAT VE DİĞER FAALİYETLERDEN ELDE EDİLEN KAZANCIN TOPLAM TİCARİ KAZANÇ İÇİNDEKİ PAYLARI ",null,{"$f":"IFERROR(IF(AND(D73+E73>C73, F73<=0),1,(D73+E73)/C73),0)","v":0.6},null,{"$f":"IFERROR(IF(F73<=0,0,F73/C73),0)","v":0.4}]
[null,"NEGATİF VE % 100 DEN BÜYÜKLÜK KONTROLÜ SONRASINDAKİ PAYLARI",null,{"$f":"IFERROR(IF(D75<=0,0,IF(D75>1,1,D75)),0)","v":0.6},null,{"$f":"IFERROR(IF(F75<=0,0,IF(F75>1,1,F75)),0)","v":0.4}]
[]
[null,"SAFİ KURUM KAZANCI \n(KURUMLAR VERGİSİ MATRAHI)",{"$f":"C59+C63-C64-C65-C69-C70","v":2000000},{"$f":"IF(C78<0, \"ZARAR\",\"KAR\")","v":"KAR"}]
[]
[null,"2022 YILI 3. DÖNEM İNDİRİMLİ KURUMLAR VERGİSİ HESAPLAMA TABLOSU"]
[null,null,"1. TEŞVİK BELGESİ","2. TEŞVİK BELGESİ","3. TEŞVİK BELGESİ","4. TEŞVİK BELGESİ","5. TEŞVİK BELGESİ"]
[null,"Vergi İndirim Oranı (VİO)"]
[null,"KV MATRAHI (Safi Kurum Kazancı)",{"$f":"C78","v":2000000}]
[null,"32/A  Uygulanacak K.V. Matrahı (HER BİR TEŞVİK BELGESİ KAPSAMINDA YARARLANILABİLECEK YATIRIMA KATKI TUTARININ MATRAHI BU HÜCRELERE YAZILMALIDIR)",null,null,null,null,null,{"$f":"IF(SUM(C84:G84)>C78,\"32/A İNDİRİMİ UYGULANACAK KAZANÇ, SAFİ KURUM KAZANCINDAN FAZLADIR\",SUM(C84:G84))","v":0}]
[null,"32/A UYGULANMAYACAK K.V.  Matrahı",{"$f":"IF(C83-(C84+D84+E84+F84+G84)<0,0,C83-(C84+D84+E84+F84+G84))","v":2000000}]
[null,"MATRAH TOPLAMI",{"$f":"IF((C84+D84+E84+F84+G84+C85)>C78,C78,(C84+D84+E84+F84+G84+C85))","v":2000000}]
[]
[null,"SAFİ KURUM KAZANCININ  KV VERGİ ORANLARI İTİBARİYLE DAĞILIMI ","TOPLAM SAFİ KAZANÇ","İhracat Kazancı Payı","Üretim Kazancı Payı","Diğer Faaliyet Kazancı Payı"]
[]
[null,null,{"$f":"C78","v":2000000},{"$f":"IF(AND(AND($D$59>0,($D$59+$E$59)>=$C$59,D59>=C66),$C$90>=MAX(D59,D73)),\n\nMIN(MAX(IF(D59<=C90,D59,IF(D73<=C90,D73)),$C$90*D74)),\n\nIF(OR(D59<=0,D73<=0),0,\n\nMIN( MAX(   MAX(   IF(D59<=C90,D59),  IF(D73<=C90,D73) ),    MIN($C$90*D74,D59,D73)),$C$90)))","v":1200000},{"$f":"MIN( IF(AND(AND($E$59>0,($D$59+$E$59)>=$C$59,E59>=C67),$C$90>=MAX(E59,E73)),\n\nMIN(MAX(IF(E59<=C90,E59,IF(E73<=C90,E73)),$C$90*E74)),\n\nIF(OR(E59<=0,E73<=0),0,\n\nMIN( MAX(   MAX(   IF(E59<=C90,E59),  IF(E73<=C90,E73) ),    MIN($C$90*E74,E59,E73)),$C$90))),C90-D90)","v":0},{"$f":"C90-D90-E90","v":800000}]
[null,"SAFİ KURUM KAZANCININ DAĞILIMI ORANSAL DAĞILIMI",{"$f":"C90","v":2000000},{"$f":"D90/C90","v":0.6},{"$f":"E90/C90","v":0},{"$f":"F90/C90","v":0.4}]
[null,"SAFİ KURUM KAZANCININ DAĞILIMI TUTARSAL",{"$f":"C91","v":2000000},{"$f":"D90","v":1200000},{"$f":"E90","v":0},{"$f":"F90","v":800000}]
[null,"SAFİ KURUM KAZANCI DAĞILIMI",{"$f":"C92","v":2000000},{"$f":"IFERROR(IF(D92/C92>=1,1,D92/C92),0)","v":0.6},{"$f":"IFERROR(IF(E92/C92>=1,1,E92/C92),0)","v":0},{"$f":"IFERROR(IF(F92/C92>=1,1,F92/C92),0)","v":0.4},null,"KV ORANI"]
[null,"1 PUAN VE 32/A İNDİRİMİ OLMASAYDI HESAPLANAN KV TUTARI",{"$f":"C93*$H$94","v":500000},{"$f":"D92*$H$94","v":300000},{"$f":"E92*$H$94","v":0},{"$f":"F92*$H$94","v":200000},null,0.25]
[null,"32/ A UYGULANAN MATRAH",{"$f":"C84+D84+E84+F84+G84","v":0},{"$f":"D107+D112+D117+D122+D127","v":0},{"$f":"D106+D111+D116+D121+D126","v":0},{"$f":"D105+D110+D115+D120+D125","v":0}]
[null,"32/A UYGULANACAK MATRAH ÜZERİNDEN ÖDENECEK KV TUTARI",{"$f":"J108+J113+J118+J123+J128","v":0},{"$f":"J107+J112+J117+J122+J127","v":0},{"$f":"J106+J111+J116+J121+J126","v":0},{"$f":"J105+J110+J115+J120+J125","v":0}]
[null,"32/A UYGULANMAYAN MATRAH",{"$f":"IF(C85<=0,0,C85)","v":2000000},{"$f":"D132","v":1200000},{"$f":"D131","v":0},{"$f":"D130","v":800000}]
[null,"32/A UYGULANMAYAN MATRAH ÜZERİNDEN ÖDENECEK KV TUTARI",{"$f":"L130","v":440000},{"$f":"J132","v":240000},{"$f":"J131","v":0},{"$f":"J130","v":200000}]
[null,"TOPLAM ÖDENECEK KV",{"$f":"C96+C98","v":440000},{"$f":"J132+J107","v":240000},{"$f":"J131+J106","v":0},{"$f":"J130+J105","v":200000}]
[null,"TOPLAM AVANTAJ  (YARARLANILAN 1 PUAN İNDİRİMİ + 32/A İNDİRİMİ TUTARI )",{"$f":"C94-C99","v":60000},{"$f":"D101+D102","v":60000},{"$f":"E101+E102","v":0},{"$f":"F101+F102","v":0}]
[null,"YARARLANILAN 1 - 5 PUAN İNDİRİMİ TUTARI",{"$f":"F133+F128+F123+F118+F113+F108","v":60000},{"$f":"F132+F107+F112+F117+F122+F127","v":60000},{"$f":"F131+F106+F111+F116+F121+F126","v":0},{"$f":"F130+F105+F110+F115+F120+F125","v":0}]
[null,"YARLANILAN 32/A İNDİRİMİ TUTARI",{"$f":"K108+K113+K118+K123+K128+K133","v":0},{"$f":"K107+K112+K122+K127+K132","v":0},{"$f":"K106+K111+K116+K121+K126+K131","v":0},{"$f":"K105++K110+K115+K120+K125+K130","v":0}]
[]
[null,"32/A UYGULANABİLECEK MATRAH (1.TEŞVİK BELGESİ)",{"$f":"C84","v":0},"KV MATRAHI","1 - 5 PUAN İNDİRİM OLMASAYDI HESAPLANAN KV TUTARI","1 -5 Puan İndirim Tutarı","1 - 5 Puan İndirim Sonrasında Hesaplanan KV Tutarı","32/A İndirimi Olmasaydı Ödenecek KV Tutarı","1 -5 Puan İndirim ve 32/A VİO Uygulandıktan Sonra Tatbik Edilecek KV Oranı","1 -5 Puan İndirim ve 32/A İndirimi Uygulandıktan Sonra Ödenecek  KV Tutarı","Yararlanılan Yatırıma Katkı Tutarı\n(32/A İnd. KV Nedeniyle Vazgeçilen Vergi Tutarı)","Ödenecek KV Tutarı"]
[null,"GENEL ORANA TABİ KISIM (DİĞER FAALİYETLER)",{"$f":"F93","v":0.4},{"$f":"C104*C105","v":0},{"$f":"D105*$H$94","v":0},0,{"$f":"E105-F105","v":0},{"$f":"G105","v":0},{"$f":"($H$94)-(($H$94)*$C$82)","v":0.25},{"$f":"I105*D105","v":0},{"$f":"G105-J105","v":0},{"$f":"J108","v":0}]
[null,"1 PUAN İNDİRİMLİ ORANA TABİ KISIM  (İMALAT)",{"$f":"E93","v":0},{"$f":"C104*C106","v":0},{"$f":"D106*$H$94","v":0},{"$f":"D106/100","v":0},{"$f":"E106-F106","v":0},{"$f":"G106","v":0},{"$f":"($H$94-0.01)-(($H$94-0.01)*$C$82)","v":0.24},{"$f":"I106*D106","v":0},{"$f":"G106-J106","v":0}]
[null,"5 PUAN İNDİRİMLİ ORANA TABİ KISIM  ( İHRACAT)",{"$f":"D93","v":0.6},{"$f":"C104*C107","v":0},{"$f":"D107*$H$94","v":0},{"$f":"D107/20","v":0},{"$f":"E107-F107","v":0},0,{"$f":"($H$94-0.05)-(($H$94-0.05)*C82)","v":0.2},0,{"$f":"G107-J107","v":0}]
[null,"TOPLAM",{"$f":"SUM(C105:C107)","v":1},{"$f":"SUM(D105:D107)","v":0},0,{"$f":"SUM(F105:F107)","v":0},{"$f":"SUM(G105:G107)","v":0},{"$f":"SUM(H105:H107)","v":0},null,0,0]
[null,"32/A UYGULANABİLECEK MATRAH (2.TEŞVİK BELGESİ)",{"$f":"D84","v":0},"KV MATRAHI","1 - 5 PUAN İNDİRİM OLMASAYDI HESAPLANAN KV TUTARI","1 -5 Puan İndirim Tutarı","1 -5 Puan İndirim Sonrasında Hesaplanan KV Tutarı","32/A İndirimi Olmasaydı Ödenecek KV Tutarı","1 - 5 Puan İndirim ve 32/A VİO Uygulandıktan Sonra Tatbik Edilecek KV Oranı","1-5  Puan İndirim ve 32/A İndirimi Uygulandıktan Sonra Ödenecek  KV Tutarı","Yararlanılan Yatırıma Katkı Tutarı\n(32/A İnd. KV Nedeniyle Vazgeçilen Vergi Tutarı)","Ödenecek KV Tutarı"]
[null,"GENEL ORANA TABİ KISIM (DİĞER FAALİYETLER)",{"$f":"F93","v":0.4},{"$f":"C109*C110","v":0},{"$f":"D110*$H$94","v":0},0,{"$f":"E110-F110","v":0},{"$f":"G110","v":0},{"$f":"($H$94)-(($H$94)*D82)","v":0.25},{"$f":"I110*D110","v":0},{"$f":"G110-J110","v":0},{"$f":"J113","v":0}]
[null,"1 PUAN İNDİRİMLİ ORANA TABİ KISIM  (İMALAT)",{"$f":"E93","v":0},{"$f":"C109*C111","v":0},{"$f":"D111*$H$94","v":0},{"$f":"D111/100","v":0},{"$f":"E111-F111","v":0},{"$f":"G111","v":0},{"$f":"($H$94-0.01)-(($H$94-0.01)*D82)","v":0.24},{"$f":"I111*D111","v":0},{"$f":"G111-J111","v":0}]
[null,"5 PUAN İNDİRİMLİ ORANA TABİ KISIM  ( İHRACAT)",{"$f":"D93","v":0.6},{"$f":"C109*C112","v":0},{"$f":"D112*$H$94","v":0},{"$f":"D112/20","v":0},{"$f":"E112-F112","v":0},0,{"$f":"($H$94-0.05)-(($H$94-0.05)*D82)","v":0.2},0,{"$f":"G112-J112","v":0}]
[null,"TOPLAM",{"$f":"SUM(C110:C112)","v":1},0,0,{"$f":"SUM(F110:F112)","v":0},{"$f":"SUM(G110:G112)","v":0},{"$f":"SUM(H110:H112)","v":0},null,{"$f":"SUM(J110:J112)","v":0},0]
[null,"32/A UYGULANABİLECEK MATRAH (3.TEŞVİK BELGESİ)",{"$f":"E84","v":0},"KV MATRAHI","1 - 5 PUAN İNDİRİM OLMASAYDI HESAPLANAN KV TUTARI","1-5 Puan İndirim Tutarı","1 - 5 Puan İndirim Sonrasında Hesaplanan KV Tutarı","32/A İndirimi Olmasaydı Ödenecek KV Tutarı","1 - 5 Puan İndirim ve 32/A VİO Uygulandıktan Sonra Tatbik Edilecek KV Oranı","1 -5 Puan İndirim ve 32/A İndirimi Uygulandıktan Sonra Ödenecek  KV Tutarı","Yararlanılan Yatırıma Katkı Tutarı\n(32/A İnd. KV Nedeniyle Vazgeçilen Vergi Tutarı)","Ödenecek KV Tutarı"]
[null,"GENEL ORANA TABİ KISIM (DİĞER FAALİYETLER)",{"$f":"F93","v":0.4},{"$f":"C114*C115","v":0},{"$f":"D115*$H$94","v":0},0,{"$f":"E115-F115","v":0},{"$f":"G115","v":0},{"$f":"($H$94)-(($H$94)*E82)","v":0.25},{"$f":"I115*D115","v":0},{"$f":"G115-J115","v":0},{"$f":"J118","v":0}]
[null,"1 PUAN İNDİRİMLİ ORANA TABİ KISIM  (İMALAT)",{"$f":"E93","v":0},{"$f":"C114*C116","v":0},{"$f":"D116*$H$94","v":0},{"$f":"D116/100","v":0},{"$f":"E116-F116","v":0},{"$f":"G116","v":0},{"$f":"($H$94-0.01)-(($H$94-0.01)*E82)","v":0.24},{"$f":"I116*D116","v":0},{"$f":"G116-J116","v":0}]
[null,"5 PUAN İNDİRİMLİ ORANA TABİ KISIM  ( İHRACAT)",{"$f":"D93","v":0.6},{"$f":"C114*C117","v":0},{"$f":"D117*$H$94","v":0},{"$f":"D117/20","v":0},{"$f":"E117-F117","v":0},0,{"$f":"($H$94-0.05)-(($H$94-0.05)*E82)","v":0.2},0,{"$f":"G117-J117","v":0}]
[null,"TOPLAM",{"$f":"SUM(C115:C117)","v":1},0,0,{"$f":"SUM(F115:F117)","v":0},{"$f":"SUM(G115:G117)","v":0},{"$f":"SUM(H115:H117)","v":0},null,{"$f":"SUM(J115:J117)","v":0},0]
[null,"32/A UYGULANABİLECEK MATRAH (4. TEŞVİK BELGESİ)",{"$f":"F84","v":0},"KV MATRAHI","1 - 5 PUAN İNDİRİM OLMASAYDI HESAPLANAN KV TUTARI","1-5 Puan İndirim Tutarı","1 -5 Puan İndirim Sonrasında Hesaplanan KV Tutarı","32/A İndirimi Olmasaydı Ödenecek KV Tutarı","1- 5  Puan İndirim ve 32/A VİO Uygulandıktan Sonra Tatbik Edilecek KV Oranı","1-5 Puan İndirim ve 32/A İndirimi Uygulandıktan Sonra Ödenecek  KV Tutarı","Yararlanılan Yatırıma Katkı Tutarı\n(32/A İnd. KV Nedeniyle Vazgeçilen Vergi Tutarı)","Ödenecek KV Tutarı"]
[null,"GENEL ORANA TABİ KISIM (DİĞER FAALİYETLER)",{"$f":"F93","v":0.4},{"$f":"C119*C120","v":0},{"$f":"D120*$H$94","v":0},0,{"$f":"E120-F120","v":0},{"$f":"G120","v":0},{"$f":"($H$94)-(($H$94)*F82)","v":0.25},{"$f":"I120*D120","v":0},{"$f":"G120-J120","v":0},{"$f":"J123","v":0}]
[null,"1 PUAN İNDİRİMLİ ORANA TABİ KISIM  (İMALAT)",{"$f":"E93","v":0},{"$f":"C119*C121","v":0},{"$f":"D121*$H$94","v":0},{"$f":"D121/100","v":0},{"$f":"E121-F121","v":0},{"$f":"G121","v":0},{"$f":"($H$94-0.01)-(($H$94-0.01)*F82)","v":0.24},{"$f":"I121*D121","v":0},{"$f":"G121-J121","v":0}]
[null,"5 PUAN İNDİRİMLİ ORANA TABİ KISIM  ( İHRACAT)",{"$f":"D93","v":0.6},{"$f":"C119*C122","v":0},{"$f":"D122*$H$94","v":0},{"$f":"D122/20","v":0},{"$f":"E122-F122","v":0},0,{"$f":"($H$94-0.05)-(($H$94-0.05)*F82)","v":0.2},0,{"$f":"G122-J122","v":0}]
[null,"TOPLAM",{"$f":"SUM(C120:C122)","v":1},0,0,{"$f":"SUM(F120:F122)","v":0},{"$f":"SUM(G120:G122)","v":0},{"$f":"SUM(H120:H122)","v":0},null,{"$f":"SUM(J120:J122)","v":0},0]
[null,"32/A UYGULANABİLECEK MATRAH (5.TEŞVİK BELGESİ)",{"$f":"G84","v":0},"KV MATRAHI","1 - 5 PUAN İNDİRİM OLMASAYDI HESAPLANAN KV TUTARI","1-5 Puan İndirim Tutarı","1 - 5 Puan İndirim Sonrasında Hesaplanan KV Tutarı","32/A İndirimi Olmasaydı Ödenecek KV Tutarı","1 -5 Puan İndirim ve 32/A VİO Uygulandıktan Sonra Tatbik Edilecek KV Oranı","1 - 5 Puan İndirim ve 32/A İndirimi Uygulandıktan Sonra Ödenecek  KV Tutarı","Yararlanılan Yatırıma Katkı Tutarı\n(32/A İnd. KV Nedeniyle Vazgeçilen Vergi Tutarı)","Ödenecek KV Tutarı"]
[null,"GENEL ORANA TABİ KISIM (DİĞER FAALİYETLER)",{"$f":"F93","v":0.4},{"$f":"C124*C125","v":0},{"$f":"D125*$H$94","v":0},0,{"$f":"E125-F125","v":0},{"$f":"G125","v":0},{"$f":"($H$94)-(($H$94)*G82)","v":0.25},{"$f":"I125*D125","v":0},{"$f":"G125-J125","v":0},{"$f":"J128","v":0}]
[null,"1 PUAN İNDİRİMLİ ORANA TABİ KISIM  (İMALAT)",{"$f":"E93","v":0},{"$f":"C124*C126","v":0},{"$f":"D126*$H$94","v":0},{"$f":"D126/100","v":0},{"$f":"E126-F126","v":0},{"$f":"G126","v":0},{"$f":"($H$94-0.01)-(($H$94-0.01)*G82)","v":0.24},{"$f":"I126*D126","v":0},{"$f":"G126-J126","v":0}]
[null,"5 PUAN İNDİRİMLİ ORANA TABİ KISIM  ( İHRACAT)",{"$f":"D93","v":0.6},{"$f":"C124*C127","v":0},{"$f":"D127*$H$94","v":0},{"$f":"D127/20","v":0},{"$f":"E127-F127","v":0},0,{"$f":"($H$94-0.05)-(($H$94-0.05)*G82)","v":0.2},0,{"$f":"G127-J127","v":0}]
[null,"TOPLAM",{"$f":"SUM(C125:C127)","v":1},0,0,{"$f":"SUM(F125:F127)","v":0},{"$f":"SUM(G125:G127)","v":0},{"$f":"SUM(H125:H127)","v":0},null,{"$f":"SUM(J125:J127)","v":0},0]
[null,"32/A UYGULANAMAYACAK MATRAH",{"$f":"IF(C85<=0,0,C85)","v":2000000},"KV MATRAHI","1-5 PUAN İNDİRİM OLMASAYDI HESAPLANAN KV TUTARI","1-5 Puan İndirim Tutarı","1 -5 Puan İndirim Sonrasında Hesaplanan KV Tutarı","32/A İNDİRİMİ UYGULANMAZ",null,"1 Puan İndirim ve 32/A İndirimi Uygulandıktan Sonra Ödenecek  KV Tutarı","Yararlanılan Yatırıma Katkı Tutarı\n(32/A İnd. KV Nedeniyle Vazgeçilen Vergi Tutarı)","Ödenecek KV Tutarı"]
[null,"GENEL ORANA TABİ KISIM (DİĞER FAALİYETLER)",{"$f":"F93","v":0.4},{"$f":"C129*C130","v":800000},{"$f":"D130*$H$94","v":200000},0,{"$f":"E130-F130","v":200000},null,null,{"$f":"G130","v":200000},{"$f":"G130-J130","v":0},{"$f":"J133","v":440000}]
[null,"1 PUAN İNDİRİMLİ ORANA TABİ KISIM  (İMALAT)",{"$f":"E93","v":0},{"$f":"C131*C129","v":0},{"$f":"D131*$H$94","v":0},{"$f":"D131/100","v":0},{"$f":"E131-F131","v":0},null,null,{"$f":"G131","v":0},{"$f":"G131-J131","v":0}]
[null,"5 PUAN İNDİRİMLİ ORANA TABİ KISIM  ( İHRACAT)",{"$f":"D93","v":0.6},{"$f":"C132*C129","v":1200000},{"$f":"D132*$H$94","v":300000},{"$f":"D132/20","v":60000},{"$f":"E132-F132","v":240000},null,null,240000,0]
[null,"TOPLAM",{"$f":"SUM(C130:C132)","v":1},{"$f":"SUM(D130:D132)","v":2000000},500000,{"$f":"SUM(F130:F132)","v":60000},{"$f":"SUM(G130:G132)","v":440000},null,null,440000,0]
[null,"TOPLAM KV MATRAHI VE ÖDENMESİ GEREKEN KV ",{"$f":"C104+C129+C109+C114+C119+C124","v":2000000},{"$f":"D108+D133+D113+D118+D123+D128","v":2000000},{"$f":"E108+E133+E113+E118+E123+E128","v":500000},{"$f":"F108+F133+F113+F118+F123+F128","v":60000},{"$f":"G108+G133+G113+G118+G123+G128","v":440000},null,null,{"$f":"J108+J133+J113+J118+J123+J128","v":440000},{"$f":"K133+K108+K113+K118+K123+K128","v":0},{"$f":"L105+L130+L110+L115+L120+L125","v":440000}]
[]
[null,"GEÇİCİ VERGİ BEYANNMESİNDE MATRAH BİLDİRİMİ BÖLÜMÜNDE DOLDURULACAK KISIMLAR VE TUTARLARI"]
[null,"32 A Madde Kapsamında İndirimli Kurumlar Vergisine (Geçici Vergiye) Tabi Matrah",{"$f":"C104+C109+C114+C119+C124","v":0},{"$f":"E108+E113+E118+E123+E128","v":0},"1-5 Puan Olmasaydı Hesaplan KV Tutarı"]
[null,null,null,{"$f":"G108+G113+G118+G123++G128","v":0},"1 -5 Puan İndirim Sonrasında Ödenecek KV Tutarı\n (32 A olmasaydı hesaplanacak Vergi)"]
[null,null,null,{"$f":"K108+K113+K118+K123+K128","v":0},"32/A İndirimi ile Vazgeçilen Vergi"]
[null,"32 A Madde Kapsamında İndirimli Kurumlar Vergisi(Geçici Vergi) Oranı",{"$f":"IFERROR(D140/C137,0)","v":0},{"$f":"L105+L110+L115+L120+L125","v":0},"32/A ya Tabi Matrah Üzerinden Ödenecek KV"]
[null,"32/7 Madde Kapsamında İndirimli Kurumlar Vergisine (Geçici Vergiye) Tabi Matrah  (İhracat)",{"$f":"D132","v":1200000},{"$f":"E132","v":300000},"5 Puan Olmasaydı Hesaplan KV Tutarı"]
[null,null,null,{"$f":"F132","v":60000},"5 Puan İndirimin Vergi Etkisi "]
[null,"32/7 Madde Kapsamında İndirimli Kurumlar Vergisi (Geçici Vergi) Oranı",{"$f":"IFERROR(D143/C141,0)","v":0.2},{"$f":"G132","v":240000},"5 Puan İndirim Sonrasında Ödenecek KV Tutarı (İhracat)\n"]
[null,"32/8 Madde Kapsamında İndirimli Kurumlar Vergisine (Geçici Vergiye) Tabi Matrah  (Üretim)",{"$f":"D131","v":0},{"$f":"E131","v":0},"1 Puan Olmasaydı Hesaplan KV Tutarı"]
[null,null,null,{"$f":"F131","v":0},"1 Puan İndirimin Vergi Etkisi "]
[null,"32/8 Madde Kapsamında İndirimli Kurumlar Vergisi (Geçici Vergi) Oranı",{"$f":"IFERROR(D146/C144,0)","v":0},{"$f":"G131","v":0},"1 Puan İndirim Sonrasında Ödenecek KV Tutarı (Üretim)\n"]
[null,"Genel Orana Tabi Matrah (Diğer)",{"$f":"D130","v":800000},{"$f":"J130","v":200000},"Diğer Faalilyetlerden Elde Edilen Kazanç"]
[null,null,{"$f":"IFERROR(D147/C147,0)","v":0.25}]
[null,"MATRAHLAR TOPLAMI",{"$f":"C137+C144+C141+C147","v":2000000},{"$f":"D140+D146+D143+D147","v":440000}]

{"sheet":"İ Ö 3","index":4,"n_rows":149,"n_cols":12,"rows_kept":149,"cut":false,"hidden":true,"merged":[[84,2,84,6],[1,1,2,1],[59,1,59,2],[60,1,60,2],[71,1,72,1],[73,1,73,2],[74,1,74,2],[74,3,74,4],[75,1,75,2],[75,3,75,4],[79,1,79,3],[82,2,82,6],[85,2,85,6],[87,1,89,1],[87,2,88,2],[87,3,88,3],[87,4,88,4],[87,5,88,5],[135,1,135,4],[137,1,138,2],[104,11,107,11],[109,11,112,11],[114,11,117,11],[119,11,122,11],[124,11,127,11],[128,7,133,8],[129,11,132,11]]}
[]
[null,"FAALİYET TÜRLERİ İTİBARİYLE HASILATLAR VE TOPLAM İÇİNDEKİ ORANLARI",{"$f":"IFERROR(C4/C4,0)","v":1},{"$f":"IFERROR(D4/C4,0)","v":1.2},{"$f":"IFERROR(E4/C4,0)","v":0},{"$f":"IFERROR(F4/C4,0)","v":-0.2}]
[null,null,"Toplam Hasılat","İhracat faaliyeti","İmalat faaliyeti","Diğer faaliyetler"]
[null,"A-BRÜT SATIŞLAR (60)",{"$f":"D4+E4+F4","v":500000},{"$f":"SUM(D5:D7)","v":600000},{"$f":"SUM(E5:E7)","v":0},-100000]
[null,"1-Yurtiçi Satışlar (600)",{"$f":"D5+E5+F5","v":-100000},null,null,-100000]
[null,"2-Yurtdışı Satışlar (601)",{"$f":"D6+E6+F6","v":600000},600000]
[null,"3-Diğer Gelirler (602)",{"$f":"D7+E7+F7","v":0}]
[null,"B-SATIŞ İNDİRİMLERİ(-) (61)",{"$f":"SUM(C9:C11)","v":0},{"$f":"SUM(D9:D11)","v":0},{"$f":"SUM(E9:E11)","v":0},0]
[null,"1-Satıştan İadeler (-) (610)",{"$f":"SUM(D9:F9)","v":0}]
[null,"2- Satış İskontoları (-) (611)",{"$f":"SUM(D10:F10)","v":0}]
[null,"3-Diğer İndirimler (-) (612)",0]
[null,"C-NET SATIŞLAR",{"$f":"C4-C8","v":500000},{"$f":"D4-D8","v":600000},{"$f":"E4-E8","v":0},-100000]
[null,"D-SATIŞLARIN MALİYETİ (-) (62)",{"$f":"SUM(C14:C17)","v":0},{"$f":"SUM(D14:D17)","v":0},{"$f":"SUM(E14:E17)","v":0},{"$f":"SUM(F14:F17)","v":0}]
[null,"1-Satılan Mamuller Maliyeti ( 620)",{"$f":"SUM(D14:F14)","v":0}]
[null,"2-Satılan Ticari Mal Maliyeti (621)",{"$f":"SUM(D15:F15)","v":0}]
[null,"3-Satılan Hizmet Maliyeti (622)",0]
[null,"4-Diğer Satışların Maliyeti (623)",0]
[null,"BRÜT SATIŞ KARI / ZARARI",{"$f":"C12-C13","v":500000},{"$f":"D12-D13","v":600000},{"$f":"E12-E13","v":0},-100000]
[null,"E-FAALİYET GİDERLERİ (-) (63)",{"$f":"SUM(C20:C24)","v":0},{"$f":"SUM(D20:D24)","v":0},{"$f":"SUM(E20:E24)","v":0},0]
[null,"1-Araştırma ve Geliştirme Giderleri(-) (630)",{"$f":"SUM(D20:F20)","v":0}]
[null,"2-Pazarlama, Satış ve Dağıtım Giderleri(-) (631)",{"$f":"SUM(D21:F21)","v":0}]
[null,"3-Genel Yönetim Giderleri(-) (632)",{"$f":"SUM(D22:F22)","v":0}]
[null,"MÜŞTEREK GENEL GİDERLER (DAĞITIM-HASILAT PAYINA GÖRE)",null,{"$f":"C23*D2","v":0},{"$f":"C23*E2","v":0},{"$f":"C23*F2","v":0}]
[null,"MÜŞTEREK GENEL GİDER GİBİ DAĞITIMA TABİ TUTULACAK AMORTİSMAN GİDERLERİ  (DAĞITIM-HASILAT PAYINA GÖRE)",null,{"$f":"C24*D2","v":0},{"$f":"C24*E2","v":0},{"$f":"C24*F2","v":0}]
[null,"FAALİYET KARI / ZARARI ",{"$f":"C18-C19","v":500000},{"$f":"D18-D19","v":600000},{"$f":"E18-E19","v":0},-100000]
[null,"F-DİĞER FAALİYETLERDEN OLAĞAN GELİR VE KARLAR (64)",{"$f":"SUM(C27:C35)","v":0},{"$f":"SUM(D27:D35)","v":0},{"$f":"SUM(E27:E35)","v":0},{"$f":"SUM(F27:F35)","v":0}]
[null,"         1- İŞTİRAKLERDEN TEMETTÜ GELİRLERİ (640)",{"$f":"SUM(D27:F27)","v":0}]
[null,"         2- BAĞLI ORTAKLIKLARDAN TEMETTÜ GELİRLERİ (641)",{"$f":"SUM(D28:F28)","v":0}]
[null,"         3- FAİZ GELİRLERİ (642) (ihracat ve imalat kaynaklı alacağın tahsiline kadar olan süreçte oluşan)",0]
[null,"         4- KOMİSYON GELİRLERİ (643)",0]
[null,"         5- KONUSU OLMAYAN KARŞILIKLAR (644)",0]
[null,"         6- MENKUL KIYMET SATIŞ KARLARI (645)",0]
[null,"         7- KAMBİYO KARLARI (646) (ihracat ve imalat kaynaklı alacağın tahsiline kadar olan süreçte oluşan)",0]
[null,"         8- REESKONT FAİZ GELİRLERİ (647)",0]
[null,"         9- FAALİYETLE İLGİLİ DİĞER GELİR VE KARLAR (649)",0]
[null,"ARA TOPLAM",{"$f":"C25+C26","v":500000},{"$f":"D25+D26","v":600000},{"$f":"E25+E26","v":0},{"$f":"F25+F26","v":-100000}]
[null,"G-DİĞER FAALİYETLERDEN OLAĞAN GİDER VE ZARARLAR(-) (65)",{"$f":"SUM(C38:C43)","v":0},{"$f":"SUM(D38:D43)","v":0},{"$f":"SUM(E38:E43)","v":0},0]
[null,"         1- KOMİSYON GİDERLERİ (653)",{"$f":"SUM(D38:F38)","v":0}]
[null,"         2- KARŞILIK GİDERLERİ (654)",{"$f":"SUM(D39:F39)","v":0}]
[null,"         3- MENKUL KIYMET SATIŞ ZARARLARI (655)",0]
[null,"         4- KAMBİYO ZARARLARI (656) (ihracat ve imalat kaynaklı alacağın tahsiline kadar olan süreçte oluşan)",0]
[null,"         5- REESKONT FAİZ GİDERLERİ (657)",0]
[null,"         6- DİĞER OLAĞAN GİDER VE ZARARLAR (659)",{"$f":"SUM(D43:F43)","v":0}]
[null,"ARA TOPLAM",{"$f":"C36-C37","v":500000},{"$f":"D36-D37","v":600000},{"$f":"E36-E37","v":0},-100000]
[null,"H-FİNANSMAN GİDERLERİ(-) (66)",{"$f":"SUM(C46:C49)","v":0},{"$f":"SUM(D46:D49)","v":0},{"$f":"SUM(E46:E49)","v":0},{"$f":"SUM(F46:F49)","v":0}]
[null,"         1- KISA VADELİ BORÇLANMA GİDERLERİ (-)",{"$f":"SUM(D46:F46)","v":0}]
[null,"         2- UZUN VADELİ BORÇLANMA GİDERLERİ (-)",{"$f":"SUM(D47:F47)","v":0}]
[null,"         1- KISA VADELİ BORÇLANMA GİDERLERİ (-) (DAĞITIM)",null,{"$f":"C48*D2","v":0},{"$f":"C48*E2","v":0},{"$f":"C48*F2","v":0}]
[null,"         2- UZUN VADELİ BORÇLANMA GİDERLERİ (-) (DAĞITIM)",null,{"$f":"C49*D2","v":0},{"$f":"C49*E2","v":0},{"$f":"C49*F2","v":0}]
[null,"ARA TOPLAM",{"$f":"C44-C45","v":500000},{"$f":"D44-D45","v":600000},{"$f":"E44-E45","v":0},{"$f":"F44-F45","v":-100000}]
[null,"I-OLAĞANDIŞI GELİR VE KÂRLAR (67)",{"$f":"SUM(D51:F51)","v":0},{"$f":"SUM(D52:D53)","v":0},{"$f":"SUM(E52:E53)","v":0},{"$f":"SUM(F52:F53)","v":0}]
[null,"1- ÖNCEKİ DÖNEM GELİR VE KARLARI (671)",{"$f":"SUM(D52:F52)","v":0}]
[null,"2-DİĞER OLAĞAN DIŞI GELİR VE KARLAR (679)",{"$f":"SUM(D53:F53)","v":0}]
[null,"ARA TOPLAM",{"$f":"SUM(D54:F54)","v":500000},{"$f":"D50+D51","v":600000},{"$f":"E50+E51","v":0},-100000]
[null,"J-OLAĞANDIŞI GİDER VE ZARARLAR(-) (68)",{"$f":"SUM(C56:C58)","v":0},{"$f":"SUM(D56:D58)","v":0},{"$f":"SUM(E56:E58)","v":0},0]
[null,"1-Çalışmayan Kısım Gider ve Zararları(-) (680)",{"$f":"SUM(D56:F56)","v":0}]
[null,"2-Önceki Dönem Gider ve Zararları(-) (681)",{"$f":"SUM(D57:F57)","v":0}]
[null,"3-Diğer Olağan Dışı Gider ve Zararlar(-) (689)",0]
[null,"DÖNEM KÂRI VEYA ZARARI \n(TİCARİ BİLANÇO KARI ZARARI )",{"$f":"C54-C55","v":500000},{"$f":"D54-D55","v":600000},{"$f":"E54-E55","v":0},-100000]
[null,"İHRACAT, İMALAT VE DİĞER FAALİYETLERDEN ELDE EDİLEN KAZANCIN TOPLAM TİCARİ KAZANÇ İÇİNDEKİ PAYLARI  \n\n(Kazançlar arasında Öncelik İhracat Kazancına Verilmiştir. İhrcat Kazancından arta kalan Ticari Kazanç İmalat ve Diğer Faaliyetlere Sayılmıştır.)\n\n",null,{"$f":"IF(D59>=$C$59,1,\n    IF(D59<=0,0,\n    IF(AND(D59>0,D59<$C$59),D59/$C$59)))","v":1},{"$f":"IF(E59>=$C$59,1,\n    IF(E59<=0,0,\n    IF(AND(E59>0,E59<$C$59),E59/$C$59)))","v":0},{"$f":"IF(F59>=$C$59,1,\n    IF(F59<=0,0,\n    IF(AND(F59>0,F59<$C$59),F59/$C$59)))","v":0}]
[null,null,null,{"$f":"D60/(D60+E60+F60)","v":1},{"$f":"E60/(D60+E60+F60)","v":0},{"$f":"F60/(D60+E60+F60)","v":0}]
[]
[null,"KKEG +",300000]
[null," KABUL EDİLMEYEN GELİRLER -"]
[null,"ZARAR OLSA DAHİ İNDİRİLECEK İSTİSNALAR -",{"$f":"C66+C67+C68","v":0}]
[null,"Hizmet İhracatı Faaliyetinden (KVK 10-1/ğ) Elde Edilen Kazançlardan İstisna Edilenlerin Toplamı"]
[null,"İmalat Faaliyetinden Elde Edilen Kazançlardan İstisna Edilenlerin Toplamı"]
[null,"Diğer Faaliyetlerden Elde Edilen Kazançlardan İstisna Edilenlerin Toplamı"]
[null,"GEÇMİŞ YIL ZARARLARI -"]
[null,"İNDİRİMLER -",null,"AZAMİ YAZILABİLECEK İNDİRİMLER TUTARI",{"$f":"C59+C63-C64-C65-C69","v":800000}]
[]
[null,"1 PUAN İNDİRİM UYGULANACAK TUTARIN HESABINDA İSTİSNA KAZANÇLAR DÜŞÜLDÜKTEN SONRA BULUNAN TİCARİ KAZANÇ TUTARI İLE  İHRACAT,İMALAT VE DİĞER KAZANÇLARIN TUTARI","TİCARİ KAZANÇ TAN İhracat ve İmalat Kazancından İstisna Olan Tutarlar Düşüldükten Sonra Kalan Tutarı","İhracat Faaliyetinden Elde Edilen  Kazançtan İstisna Olan Kısım Düşüldükten Sonra Bulunan Tutarı","Üretim  Faaliyetinden Elde Edilen  Kazançtan İstisna Olan Kısım Düşüldükten Sonra Bulunan Tutarı","Diğer Faaliyetinden Elde Edilen  Kazanç"]
[null,null,{"$f":"IF(C59-C66-C67<=0,0,C59-C66-C67)","v":500000},{"$f":"IF($D$59-C66<=0,0,MIN($D$59-C66,$C$73*D61))","v":500000},{"$f":"IF($E$59-C67<=0,0,MIN($E$59-C67,$C$73*E61))","v":0},{"$f":"IF(C73-D73-E73<=0,0,C73-D73-E73)","v":0}]
[null,"MATRAH DAĞITIM PAYLARI",null,{"$f":"IFERROR(IF(D73/C73<=0,0,D73/C73),0)","v":1},{"$f":"IFERROR(IF(E73/C73<=0,0,E73/C73),0)","v":0},{"$f":"IFERROR(F73/C73,0)","v":0}]
[null,"İHRACAT, İMALAT VE DİĞER FAALİYETLERDEN ELDE EDİLEN KAZANCIN TOPLAM TİCARİ KAZANÇ İÇİNDEKİ PAYLARI ",null,{"$f":"IFERROR(IF(AND(D73+E73>C73, F73<=0),1,(D73+E73)/C73),0)","v":1},null,{"$f":"IFERROR(IF(F73<=0,0,F73/C73),0)","v":0}]
[null,"NEGATİF VE % 100 DEN BÜYÜKLÜK KONTROLÜ SONRASINDAKİ PAYLARI",null,{"$f":"IFERROR(IF(D75<=0,0,IF(D75>1,1,D75)),0)","v":1},null,{"$f":"IFERROR(IF(F75<=0,0,IF(F75>1,1,F75)),0)","v":0}]
[]
[null,"SAFİ KURUM KAZANCI \n(KURUMLAR VERGİSİ MATRAHI)",{"$f":"C59+C63-C64-C65-C69-C70","v":800000},{"$f":"IF(C78<0, \"ZARAR\",\"KAR\")","v":"KAR"}]
[]
[null,"2022 YILI 3. DÖNEM İNDİRİMLİ KURUMLAR VERGİSİ HESAPLAMA TABLOSU"]
[null,null,"1. TEŞVİK BELGESİ","2. TEŞVİK BELGESİ","3. TEŞVİK BELGESİ","4. TEŞVİK BELGESİ","5. TEŞVİK BELGESİ"]
[null,"Vergi İndirim Oranı (VİO)"]
[null,"KV MATRAHI (Safi Kurum Kazancı)",{"$f":"C78","v":800000}]
[null,"32/A  Uygulanacak K.V. Matrahı (HER BİR TEŞVİK BELGESİ KAPSAMINDA YARARLANILABİLECEK YATIRIMA KATKI TUTARININ MATRAHI BU HÜCRELERE YAZILMALIDIR)",null,null,null,null,null,{"$f":"IF(SUM(C84:G84)>C78,\"32/A İNDİRİMİ UYGULANACAK KAZANÇ, SAFİ KURUM KAZANCINDAN FAZLADIR\",SUM(C84:G84))","v":0}]
[null,"32/A UYGULANMAYACAK K.V.  Matrahı",{"$f":"IF(C83-(C84+D84+E84+F84+G84)<0,0,C83-(C84+D84+E84+F84+G84))","v":800000}]
[null,"MATRAH TOPLAMI",{"$f":"IF((C84+D84+E84+F84+G84+C85)>C78,C78,(C84+D84+E84+F84+G84+C85))","v":800000}]
[]
[null,"SAFİ KURUM KAZANCININ  KV VERGİ ORANLARI İTİBARİYLE DAĞILIMI ","TOPLAM SAFİ KAZANÇ","İhracat Kazancı Payı","Üretim Kazancı Payı","Diğer Faaliyet Kazancı Payı"]
[]
[null,null,{"$f":"C78","v":800000},{"$f":"IF(AND(AND($D$59>0,($D$59+$E$59)>=$C$59,D59>=C66),$C$90>=MAX(D59,D73)),\n\nMIN(MAX(IF(D59<=C90,D59,IF(D73<=C90,D73)),$C$90*D74)),\n\nIF(OR(D59<=0,D73<=0),0,\n\nMIN( MAX(   MAX(   IF(D59<=C90,D59),  IF(D73<=C90,D73) ),    MIN($C$90*D74,D59,D73)),$C$90)))","v":800000},{"$f":"MIN( IF(AND(AND($E$59>0,($D$59+$E$59)>=$C$59,E59>=C67),$C$90>=MAX(E59,E73)),\n\nMIN(MAX(IF(E59<=C90,E59,IF(E73<=C90,E73)),$C$90*E74)),\n\nIF(OR(E59<=0,E73<=0),0,\n\nMIN( MAX(   MAX(   IF(E59<=C90,E59),  IF(E73<=C90,E73) ),    MIN($C$90*E74,E59,E73)),$C$90))),C90-D90)","v":0},{"$f":"C90-D90-E90","v":0}]
[null,"SAFİ KURUM KAZANCININ DAĞILIMI ORANSAL DAĞILIMI",{"$f":"C90","v":800000},{"$f":"D90/C90","v":1},{"$f":"E90/C90","v":0},{"$f":"F90/C90","v":0}]
[null,"SAFİ KURUM KAZANCININ DAĞILIMI TUTARSAL",{"$f":"C91","v":800000},{"$f":"D90","v":800000},{"$f":"E90","v":0},{"$f":"F90","v":0}]
[null,"SAFİ KURUM KAZANCI DAĞILIMI",{"$f":"C92","v":800000},{"$f":"IFERROR(IF(D92/C92>=1,1,D92/C92),0)","v":1},{"$f":"IFERROR(IF(E92/C92>=1,1,E92/C92),0)","v":0},{"$f":"IFERROR(IF(F92/C92>=1,1,F92/C92),0)","v":0},null,"KV ORANI"]
[null,"1 PUAN VE 32/A İNDİRİMİ OLMASAYDI HESAPLANAN KV TUTARI",{"$f":"C93*$H$94","v":200000},{"$f":"D92*$H$94","v":200000},{"$f":"E92*$H$94","v":0},{"$f":"F92*$H$94","v":0},null,0.25]
[null,"32/ A UYGULANAN MATRAH",{"$f":"C84+D84+E84+F84+G84","v":0},{"$f":"D107+D112+D117+D122+D127","v":0},{"$f":"D106+D111+D116+D121+D126","v":0},{"$f":"D105+D110+D115+D120+D125","v":0}]
[null,"32/A UYGULANACAK MATRAH ÜZERİNDEN ÖDENECEK KV TUTARI",{"$f":"J108+J113+J118+J123+J128","v":0},{"$f":"J107+J112+J117+J122+J127","v":0},{"$f":"J106+J111+J116+J121+J126","v":0},{"$f":"J105+J110+J115+J120+J125","v":0}]
[null,"32/A UYGULANMAYAN MATRAH",{"$f":"IF(C85<=0,0,C85)","v":800000},{"$f":"D132","v":800000},{"$f":"D131","v":0},{"$f":"D130","v":0}]
[null,"32/A UYGULANMAYAN MATRAH ÜZERİNDEN ÖDENECEK KV TUTARI",{"$f":"L130","v":160000},{"$f":"J132","v":160000},{"$f":"J131","v":0},{"$f":"J130","v":0}]
[null,"TOPLAM ÖDENECEK KV",{"$f":"C96+C98","v":160000},{"$f":"J132+J107","v":160000},{"$f":"J131+J106","v":0},{"$f":"J130+J105","v":0}]
[null,"TOPLAM AVANTAJ  (YARARLANILAN 1 PUAN İNDİRİMİ + 32/A İNDİRİMİ TUTARI )",{"$f":"C94-C99","v":40000},{"$f":"D101+D102","v":40000},{"$f":"E101+E102","v":0},{"$f":"F101+F102","v":0}]
[null,"YARARLANILAN 1 - 5 PUAN İNDİRİMİ TUTARI",{"$f":"F133+F128+F123+F118+F113+F108","v":40000},{"$f":"F132+F107+F112+F117+F122+F127","v":40000},{"$f":"F131+F106+F111+F116+F121+F126","v":0},{"$f":"F130+F105+F110+F115+F120+F125","v":0}]
[null,"YARLANILAN 32/A İNDİRİMİ TUTARI",{"$f":"K108+K113+K118+K123+K128+K133","v":0},{"$f":"K107+K112+K122+K127+K132","v":0},{"$f":"K106+K111+K116+K121+K126+K131","v":0},{"$f":"K105++K110+K115+K120+K125+K130","v":0}]
[]
[null,"32/A UYGULANABİLECEK MATRAH (1.TEŞVİK BELGESİ)",{"$f":"C84","v":0},"KV MATRAHI","1 - 5 PUAN İNDİRİM OLMASAYDI HESAPLANAN KV TUTARI","1 -5 Puan İndirim Tutarı","1 - 5 Puan İndirim Sonrasında Hesaplanan KV Tutarı","32/A İndirimi Olmasaydı Ödenecek KV Tutarı","1 -5 Puan İndirim ve 32/A VİO Uygulandıktan Sonra Tatbik Edilecek KV Oranı","1 -5 Puan İndirim ve 32/A İndirimi Uygulandıktan Sonra Ödenecek  KV Tutarı","Yararlanılan Yatırıma Katkı Tutarı\n(32/A İnd. KV Nedeniyle Vazgeçilen Vergi Tutarı)","Ödenecek KV Tutarı"]
[null,"GENEL ORANA TABİ KISIM (DİĞER FAALİYETLER)",{"$f":"F93","v":0},{"$f":"C104*C105","v":0},{"$f":"D105*$H$94","v":0},0,{"$f":"E105-F105","v":0},{"$f":"G105","v":0},{"$f":"($H$94)-(($H$94)*$C$82)","v":0.25},{"$f":"I105*D105","v":0},{"$f":"G105-J105","v":0},{"$f":"J108","v":0}]
[null,"1 PUAN İNDİRİMLİ ORANA TABİ KISIM  (İMALAT)",{"$f":"E93","v":0},{"$f":"C104*C106","v":0},{"$f":"D106*$H$94","v":0},{"$f":"D106/100","v":0},{"$f":"E106-F106","v":0},{"$f":"G106","v":0},{"$f":"($H$94-0.01)-(($H$94-0.01)*$C$82)","v":0.24},{"$f":"I106*D106","v":0},{"$f":"G106-J106","v":0}]
[null,"5 PUAN İNDİRİMLİ ORANA TABİ KISIM  ( İHRACAT)",{"$f":"D93","v":1},{"$f":"C104*C107","v":0},{"$f":"D107*$H$94","v":0},{"$f":"D107/20","v":0},{"$f":"E107-F107","v":0},0,{"$f":"($H$94-0.05)-(($H$94-0.05)*C82)","v":0.2},0,{"$f":"G107-J107","v":0}]
[null,"TOPLAM",{"$f":"SUM(C105:C107)","v":1},{"$f":"SUM(D105:D107)","v":0},0,{"$f":"SUM(F105:F107)","v":0},{"$f":"SUM(G105:G107)","v":0},{"$f":"SUM(H105:H107)","v":0},null,0,0]
[null,"32/A UYGULANABİLECEK MATRAH (2.TEŞVİK BELGESİ)",{"$f":"D84","v":0},"KV MATRAHI","1 - 5 PUAN İNDİRİM OLMASAYDI HESAPLANAN KV TUTARI","1 -5 Puan İndirim Tutarı","1 -5 Puan İndirim Sonrasında Hesaplanan KV Tutarı","32/A İndirimi Olmasaydı Ödenecek KV Tutarı","1 - 5 Puan İndirim ve 32/A VİO Uygulandıktan Sonra Tatbik Edilecek KV Oranı","1-5  Puan İndirim ve 32/A İndirimi Uygulandıktan Sonra Ödenecek  KV Tutarı","Yararlanılan Yatırıma Katkı Tutarı\n(32/A İnd. KV Nedeniyle Vazgeçilen Vergi Tutarı)","Ödenecek KV Tutarı"]
[null,"GENEL ORANA TABİ KISIM (DİĞER FAALİYETLER)",{"$f":"F93","v":0},{"$f":"C109*C110","v":0},{"$f":"D110*$H$94","v":0},0,{"$f":"E110-F110","v":0},{"$f":"G110","v":0},{"$f":"($H$94)-(($H$94)*D82)","v":0.25},{"$f":"I110*D110","v":0},{"$f":"G110-J110","v":0},{"$f":"J113","v":0}]
[null,"1 PUAN İNDİRİMLİ ORANA TABİ KISIM  (İMALAT)",{"$f":"E93","v":0},{"$f":"C109*C111","v":0},{"$f":"D111*$H$94","v":0},{"$f":"D111/100","v":0},{"$f":"E111-F111","v":0},{"$f":"G111","v":0},{"$f":"($H$94-0.01)-(($H$94-0.01)*D82)","v":0.24},{"$f":"I111*D111","v":0},{"$f":"G111-J111","v":0}]
[null,"5 PUAN İNDİRİMLİ ORANA TABİ KISIM  ( İHRACAT)",{"$f":"D93","v":1},{"$f":"C109*C112","v":0},{"$f":"D112*$H$94","v":0},{"$f":"D112/20","v":0},{"$f":"E112-F112","v":0},0,{"$f":"($H$94-0.05)-(($H$94-0.05)*D82)","v":0.2},0,{"$f":"G112-J112","v":0}]
[null,"TOPLAM",{"$f":"SUM(C110:C112)","v":1},0,0,{"$f":"SUM(F110:F112)","v":0},{"$f":"SUM(G110:G112)","v":0},{"$f":"SUM(H110:H112)","v":0},null,{"$f":"SUM(J110:J112)","v":0},0]
[null,"32/A UYGULANABİLECEK MATRAH (3.TEŞVİK BELGESİ)",{"$f":"E84","v":0},"KV MATRAHI","1 - 5 PUAN İNDİRİM OLMASAYDI HESAPLANAN KV TUTARI","1-5 Puan İndirim Tutarı","1 - 5 Puan İndirim Sonrasında Hesaplanan KV Tutarı","32/A İndirimi Olmasaydı Ödenecek KV Tutarı","1 - 5 Puan İndirim ve 32/A VİO Uygulandıktan Sonra Tatbik Edilecek KV Oranı","1 -5 Puan İndirim ve 32/A İndirimi Uygulandıktan Sonra Ödenecek  KV Tutarı","Yararlanılan Yatırıma Katkı Tutarı\n(32/A İnd. KV Nedeniyle Vazgeçilen Vergi Tutarı)","Ödenecek KV Tutarı"]
[null,"GENEL ORANA TABİ KISIM (DİĞER FAALİYETLER)",{"$f":"F93","v":0},{"$f":"C114*C115","v":0},{"$f":"D115*$H$94","v":0},0,{"$f":"E115-F115","v":0},{"$f":"G115","v":0},{"$f":"($H$94)-(($H$94)*E82)","v":0.25},{"$f":"I115*D115","v":0},{"$f":"G115-J115","v":0},{"$f":"J118","v":0}]
[null,"1 PUAN İNDİRİMLİ ORANA TABİ KISIM  (İMALAT)",{"$f":"E93","v":0},{"$f":"C114*C116","v":0},{"$f":"D116*$H$94","v":0},{"$f":"D116/100","v":0},{"$f":"E116-F116","v":0},{"$f":"G116","v":0},{"$f":"($H$94-0.01)-(($H$94-0.01)*E82)","v":0.24},{"$f":"I116*D116","v":0},{"$f":"G116-J116","v":0}]
[null,"5 PUAN İNDİRİMLİ ORANA TABİ KISIM  ( İHRACAT)",{"$f":"D93","v":1},{"$f":"C114*C117","v":0},{"$f":"D117*$H$94","v":0},{"$f":"D117/20","v":0},{"$f":"E117-F117","v":0},0,{"$f":"($H$94-0.05)-(($H$94-0.05)*E82)","v":0.2},0,{"$f":"G117-J117","v":0}]
[null,"TOPLAM",{"$f":"SUM(C115:C117)","v":1},0,0,{"$f":"SUM(F115:F117)","v":0},{"$f":"SUM(G115:G117)","v":0},{"$f":"SUM(H115:H117)","v":0},null,{"$f":"SUM(J115:J117)","v":0},0]
[null,"32/A UYGULANABİLECEK MATRAH (4. TEŞVİK BELGESİ)",{"$f":"F84","v":0},"KV MATRAHI","1 - 5 PUAN İNDİRİM OLMASAYDI HESAPLANAN KV TUTARI","1-5 Puan İndirim Tutarı","1 -5 Puan İndirim Sonrasında Hesaplanan KV Tutarı","32/A İndirimi Olmasaydı Ödenecek KV Tutarı","1- 5  Puan İndirim ve 32/A VİO Uygulandıktan Sonra Tatbik Edilecek KV Oranı","1-5 Puan İndirim ve 32/A İndirimi Uygulandıktan Sonra Ödenecek  KV Tutarı","Yararlanılan Yatırıma Katkı Tutarı\n(32/A İnd. KV Nedeniyle Vazgeçilen Vergi Tutarı)","Ödenecek KV Tutarı"]
[null,"GENEL ORANA TABİ KISIM (DİĞER FAALİYETLER)",{"$f":"F93","v":0},{"$f":"C119*C120","v":0},{"$f":"D120*$H$94","v":0},0,{"$f":"E120-F120","v":0},{"$f":"G120","v":0},{"$f":"($H$94)-(($H$94)*F82)","v":0.25},{"$f":"I120*D120","v":0},{"$f":"G120-J120","v":0},{"$f":"J123","v":0}]
[null,"1 PUAN İNDİRİMLİ ORANA TABİ KISIM  (İMALAT)",{"$f":"E93","v":0},{"$f":"C119*C121","v":0},{"$f":"D121*$H$94","v":0},{"$f":"D121/100","v":0},{"$f":"E121-F121","v":0},{"$f":"G121","v":0},{"$f":"($H$94-0.01)-(($H$94-0.01)*F82)","v":0.24},{"$f":"I121*D121","v":0},{"$f":"G121-J121","v":0}]
[null,"5 PUAN İNDİRİMLİ ORANA TABİ KISIM  ( İHRACAT)",{"$f":"D93","v":1},{"$f":"C119*C122","v":0},{"$f":"D122*$H$94","v":0},{"$f":"D122/20","v":0},{"$f":"E122-F122","v":0},0,{"$f":"($H$94-0.05)-(($H$94-0.05)*F82)","v":0.2},0,{"$f":"G122-J122","v":0}]
[null,"TOPLAM",{"$f":"SUM(C120:C122)","v":1},0,0,{"$f":"SUM(F120:F122)","v":0},{"$f":"SUM(G120:G122)","v":0},{"$f":"SUM(H120:H122)","v":0},null,{"$f":"SUM(J120:J122)","v":0},0]
[null,"32/A UYGULANABİLECEK MATRAH (5.TEŞVİK BELGESİ)",{"$f":"G84","v":0},"KV MATRAHI","1 - 5 PUAN İNDİRİM OLMASAYDI HESAPLANAN KV TUTARI","1-5 Puan İndirim Tutarı","1 - 5 Puan İndirim Sonrasında Hesaplanan KV Tutarı","32/A İndirimi Olmasaydı Ödenecek KV Tutarı","1 -5 Puan İndirim ve 32/A VİO Uygulandıktan Sonra Tatbik Edilecek KV Oranı","1 - 5 Puan İndirim ve 32/A İndirimi Uygulandıktan Sonra Ödenecek  KV Tutarı","Yararlanılan Yatırıma Katkı Tutarı\n(32/A İnd. KV Nedeniyle Vazgeçilen Vergi Tutarı)","Ödenecek KV Tutarı"]
[null,"GENEL ORANA TABİ KISIM (DİĞER FAALİYETLER)",{"$f":"F93","v":0},{"$f":"C124*C125","v":0},{"$f":"D125*$H$94","v":0},0,{"$f":"E125-F125","v":0},{"$f":"G125","v":0},{"$f":"($H$94)-(($H$94)*G82)","v":0.25},{"$f":"I125*D125","v":0},{"$f":"G125-J125","v":0},{"$f":"J128","v":0}]
[null,"1 PUAN İNDİRİMLİ ORANA TABİ KISIM  (İMALAT)",{"$f":"E93","v":0},{"$f":"C124*C126","v":0},{"$f":"D126*$H$94","v":0},{"$f":"D126/100","v":0},{"$f":"E126-F126","v":0},{"$f":"G126","v":0},{"$f":"($H$94-0.01)-(($H$94-0.01)*G82)","v":0.24},{"$f":"I126*D126","v":0},{"$f":"G126-J126","v":0}]
[null,"5 PUAN İNDİRİMLİ ORANA TABİ KISIM  ( İHRACAT)",{"$f":"D93","v":1},{"$f":"C124*C127","v":0},{"$f":"D127*$H$94","v":0},{"$f":"D127/20","v":0},{"$f":"E127-F127","v":0},0,{"$f":"($H$94-0.05)-(($H$94-0.05)*G82)","v":0.2},0,{"$f":"G127-J127","v":0}]
[null,"TOPLAM",{"$f":"SUM(C125:C127)","v":1},0,0,{"$f":"SUM(F125:F127)","v":0},{"$f":"SUM(G125:G127)","v":0},{"$f":"SUM(H125:H127)","v":0},null,{"$f":"SUM(J125:J127)","v":0},0]
[null,"32/A UYGULANAMAYACAK MATRAH",{"$f":"IF(C85<=0,0,C85)","v":800000},"KV MATRAHI","1-5 PUAN İNDİRİM OLMASAYDI HESAPLANAN KV TUTARI","1-5 Puan İndirim Tutarı","1 -5 Puan İndirim Sonrasında Hesaplanan KV Tutarı","32/A İNDİRİMİ UYGULANMAZ",null,"1 Puan İndirim ve 32/A İndirimi Uygulandıktan Sonra Ödenecek  KV Tutarı","Yararlanılan Yatırıma Katkı Tutarı\n(32/A İnd. KV Nedeniyle Vazgeçilen Vergi Tutarı)","Ödenecek KV Tutarı"]
[null,"GENEL ORANA TABİ KISIM (DİĞER FAALİYETLER)",{"$f":"F93","v":0},{"$f":"C129*C130","v":0},{"$f":"D130*$H$94","v":0},0,{"$f":"E130-F130","v":0},null,null,{"$f":"G130","v":0},{"$f":"G130-J130","v":0},{"$f":"J133","v":160000}]
[null,"1 PUAN İNDİRİMLİ ORANA TABİ KISIM  (İMALAT)",{"$f":"E93","v":0},{"$f":"C131*C129","v":0},{"$f":"D131*$H$94","v":0},{"$f":"D131/100","v":0},{"$f":"E131-F131","v":0},null,null,{"$f":"G131","v":0},{"$f":"G131-J131","v":0}]
[null,"5 PUAN İNDİRİMLİ ORANA TABİ KISIM  ( İHRACAT)",{"$f":"D93","v":1},{"$f":"C132*C129","v":800000},{"$f":"D132*$H$94","v":200000},{"$f":"D132/20","v":40000},{"$f":"E132-F132","v":160000},null,null,160000,0]
[null,"TOPLAM",{"$f":"SUM(C130:C132)","v":1},{"$f":"SUM(D130:D132)","v":800000},200000,{"$f":"SUM(F130:F132)","v":40000},{"$f":"SUM(G130:G132)","v":160000},null,null,160000,0]
[null,"TOPLAM KV MATRAHI VE ÖDENMESİ GEREKEN KV ",{"$f":"C104+C129+C109+C114+C119+C124","v":800000},{"$f":"D108+D133+D113+D118+D123+D128","v":800000},{"$f":"E108+E133+E113+E118+E123+E128","v":200000},{"$f":"F108+F133+F113+F118+F123+F128","v":40000},{"$f":"G108+G133+G113+G118+G123+G128","v":160000},null,null,{"$f":"J108+J133+J113+J118+J123+J128","v":160000},{"$f":"K133+K108+K113+K118+K123+K128","v":0},{"$f":"L105+L130+L110+L115+L120+L125","v":160000}]
[]
[null,"GEÇİCİ VERGİ BEYANNMESİNDE MATRAH BİLDİRİMİ BÖLÜMÜNDE DOLDURULACAK KISIMLAR VE TUTARLARI"]
[null,"32 A Madde Kapsamında İndirimli Kurumlar Vergisine (Geçici Vergiye) Tabi Matrah",{"$f":"C104+C109+C114+C119+C124","v":0},{"$f":"E108+E113+E118+E123+E128","v":0},"1-5 Puan Olmasaydı Hesaplan KV Tutarı"]
[null,null,null,{"$f":"G108+G113+G118+G123++G128","v":0},"1 -5 Puan İndirim Sonrasında Ödenecek KV Tutarı\n (32 A olmasaydı hesaplanacak Vergi)"]
[null,null,null,{"$f":"K108+K113+K118+K123+K128","v":0},"32/A İndirimi ile Vazgeçilen Vergi"]
[null,"32 A Madde Kapsamında İndirimli Kurumlar Vergisi(Geçici Vergi) Oranı",{"$f":"IFERROR(D140/C137,0)","v":0},{"$f":"L105+L110+L115+L120+L125","v":0},"32/A ya Tabi Matrah Üzerinden Ödenecek KV"]
[null,"32/7 Madde Kapsamında İndirimli Kurumlar Vergisine (Geçici Vergiye) Tabi Matrah  (İhracat)",{"$f":"D132","v":800000},{"$f":"E132","v":200000},"5 Puan Olmasaydı Hesaplan KV Tutarı"]
[null,null,null,{"$f":"F132","v":40000},"5 Puan İndirimin Vergi Etkisi "]
[null,"32/7 Madde Kapsamında İndirimli Kurumlar Vergisi (Geçici Vergi) Oranı",{"$f":"IFERROR(D143/C141,0)","v":0.2},{"$f":"G132","v":160000},"5 Puan İndirim Sonrasında Ödenecek KV Tutarı (İhracat)\n"]
[null,"32/8 Madde Kapsamında İndirimli Kurumlar Vergisine (Geçici Vergiye) Tabi Matrah  (Üretim)",{"$f":"D131","v":0},{"$f":"E131","v":0},"1 Puan Olmasaydı Hesaplan KV Tutarı"]
[null,null,null,{"$f":"F131","v":0},"1 Puan İndirimin Vergi Etkisi "]
[null,"32/8 Madde Kapsamında İndirimli Kurumlar Vergisi (Geçici Vergi) Oranı",{"$f":"IFERROR(D146/C144,0)","v":0},{"$f":"G131","v":0},"1 Puan İndirim Sonrasında Ödenecek KV Tutarı (Üretim)\n"]
[null,"Genel Orana Tabi Matrah (Diğer)",{"$f":"D130","v":0},{"$f":"J130","v":0},"Diğer Faalilyetlerden Elde Edilen Kazanç"]
[null,null,{"$f":"IFERROR(D147/C147,0)","v":0}]
[null,"MATRAHLAR TOPLAMI",{"$f":"C137+C144+C141+C147","v":800000},{"$f":"D140+D146+D143+D147","v":160000}]

{"sheet":"İ Ö 4","index":5,"n_rows":149,"n_cols":12,"rows_kept":149,"cut":false,"hidden":true,"merged":[[84,2,84,6],[1,1,2,1],[59,1,59,2],[60,1,60,2],[71,1,72,1],[73,1,73,2],[74,1,74,2],[74,3,74,4],[75,1,75,2],[75,3,75,4],[79,1,79,3],[82,2,82,6],[85,2,85,6],[87,1,89,1],[87,2,88,2],[87,3,88,3],[87,4,88,4],[87,5,88,5],[135,1,135,4],[137,1,138,2],[104,11,107,11],[109,11,112,11],[114,11,117,11],[119,11,122,11],[124,11,127,11],[128,7,133,8],[129,11,132,11]]}
[]
[null,"FAALİYET TÜRLERİ İTİBARİYLE HASILATLAR VE TOPLAM İÇİNDEKİ ORANLARI",{"$f":"IFERROR(C4/C4,0)","v":1},{"$f":"IFERROR(D4/C4,0)","v":1.0526315789473684},{"$f":"IFERROR(E4/C4,0)","v":0},{"$f":"IFERROR(F4/C4,0)","v":-5.2631578947368418E-2}]
[null,null,"Toplam Hasılat","İhracat faaliyeti","İmalat faaliyeti","Diğer faaliyetler"]
[null,"A-BRÜT SATIŞLAR (60)",{"$f":"D4+E4+F4","v":950000},{"$f":"SUM(D5:D7)","v":1000000},{"$f":"SUM(E5:E7)","v":0},-50000]
[null,"1-Yurtiçi Satışlar (600)",{"$f":"D5+E5+F5","v":-50000},null,null,-50000]
[null,"2-Yurtdışı Satışlar (601)",{"$f":"D6+E6+F6","v":1000000},1000000]
[null,"3-Diğer Gelirler (602)",{"$f":"D7+E7+F7","v":0}]
[null,"B-SATIŞ İNDİRİMLERİ(-) (61)",{"$f":"SUM(C9:C11)","v":0},{"$f":"SUM(D9:D11)","v":0},{"$f":"SUM(E9:E11)","v":0},0]
[null,"1-Satıştan İadeler (-) (610)",{"$f":"SUM(D9:F9)","v":0}]
[null,"2- Satış İskontoları (-) (611)",{"$f":"SUM(D10:F10)","v":0}]
[null,"3-Diğer İndirimler (-) (612)",0]
[null,"C-NET SATIŞLAR",{"$f":"C4-C8","v":950000},{"$f":"D4-D8","v":1000000},{"$f":"E4-E8","v":0},-50000]
[null,"D-SATIŞLARIN MALİYETİ (-) (62)",{"$f":"SUM(C14:C17)","v":0},{"$f":"SUM(D14:D17)","v":0},{"$f":"SUM(E14:E17)","v":0},{"$f":"SUM(F14:F17)","v":0}]
[null,"1-Satılan Mamuller Maliyeti ( 620)",{"$f":"SUM(D14:F14)","v":0}]
[null,"2-Satılan Ticari Mal Maliyeti (621)",{"$f":"SUM(D15:F15)","v":0}]
[null,"3-Satılan Hizmet Maliyeti (622)",0]
[null,"4-Diğer Satışların Maliyeti (623)",0]
[null,"BRÜT SATIŞ KARI / ZARARI",{"$f":"C12-C13","v":950000},{"$f":"D12-D13","v":1000000},{"$f":"E12-E13","v":0},-50000]
[null,"E-FAALİYET GİDERLERİ (-) (63)",{"$f":"SUM(C20:C24)","v":0},{"$f":"SUM(D20:D24)","v":0},{"$f":"SUM(E20:E24)","v":0},0]
[null,"1-Araştırma ve Geliştirme Giderleri(-) (630)",{"$f":"SUM(D20:F20)","v":0}]
[null,"2-Pazarlama, Satış ve Dağıtım Giderleri(-) (631)",{"$f":"SUM(D21:F21)","v":0}]
[null,"3-Genel Yönetim Giderleri(-) (632)",{"$f":"SUM(D22:F22)","v":0}]
[null,"MÜŞTEREK GENEL GİDERLER (DAĞITIM-HASILAT PAYINA GÖRE)",null,{"$f":"C23*D2","v":0},{"$f":"C23*E2","v":0},{"$f":"C23*F2","v":0}]
[null,"MÜŞTEREK GENEL GİDER GİBİ DAĞITIMA TABİ TUTULACAK AMORTİSMAN GİDERLERİ  (DAĞITIM-HASILAT PAYINA GÖRE)",null,{"$f":"C24*D2","v":0},{"$f":"C24*E2","v":0},{"$f":"C24*F2","v":0}]
[null,"FAALİYET KARI / ZARARI ",{"$f":"C18-C19","v":950000},{"$f":"D18-D19","v":1000000},{"$f":"E18-E19","v":0},-50000]
[null,"F-DİĞER FAALİYETLERDEN OLAĞAN GELİR VE KARLAR (64)",{"$f":"SUM(C27:C35)","v":0},{"$f":"SUM(D27:D35)","v":0},{"$f":"SUM(E27:E35)","v":0},{"$f":"SUM(F27:F35)","v":0}]
[null,"         1- İŞTİRAKLERDEN TEMETTÜ GELİRLERİ (640)",{"$f":"SUM(D27:F27)","v":0}]
[null,"         2- BAĞLI ORTAKLIKLARDAN TEMETTÜ GELİRLERİ (641)",{"$f":"SUM(D28:F28)","v":0}]
[null,"         3- FAİZ GELİRLERİ (642) (ihracat ve imalat kaynaklı alacağın tahsiline kadar olan süreçte oluşan)",0]
[null,"         4- KOMİSYON GELİRLERİ (643)",0]
[null,"         5- KONUSU OLMAYAN KARŞILIKLAR (644)",0]
[null,"         6- MENKUL KIYMET SATIŞ KARLARI (645)",0]
[null,"         7- KAMBİYO KARLARI (646) (ihracat ve imalat kaynaklı alacağın tahsiline kadar olan süreçte oluşan)",0]
[null,"         8- REESKONT FAİZ GELİRLERİ (647)",0]
[null,"         9- FAALİYETLE İLGİLİ DİĞER GELİR VE KARLAR (649)",0]
[null,"ARA TOPLAM",{"$f":"C25+C26","v":950000},{"$f":"D25+D26","v":1000000},{"$f":"E25+E26","v":0},{"$f":"F25+F26","v":-50000}]
[null,"G-DİĞER FAALİYETLERDEN OLAĞAN GİDER VE ZARARLAR(-) (65)",{"$f":"SUM(C38:C43)","v":0},{"$f":"SUM(D38:D43)","v":0},{"$f":"SUM(E38:E43)","v":0},0]
[null,"         1- KOMİSYON GİDERLERİ (653)",{"$f":"SUM(D38:F38)","v":0}]
[null,"         2- KARŞILIK GİDERLERİ (654)",{"$f":"SUM(D39:F39)","v":0}]
[null,"         3- MENKUL KIYMET SATIŞ ZARARLARI (655)",0]
[null,"         4- KAMBİYO ZARARLARI (656) (ihracat ve imalat kaynaklı alacağın tahsiline kadar olan süreçte oluşan)",0]
[null,"         5- REESKONT FAİZ GİDERLERİ (657)",0]
[null,"         6- DİĞER OLAĞAN GİDER VE ZARARLAR (659)",{"$f":"SUM(D43:F43)","v":0}]
[null,"ARA TOPLAM",{"$f":"C36-C37","v":950000},{"$f":"D36-D37","v":1000000},{"$f":"E36-E37","v":0},-50000]
[null,"H-FİNANSMAN GİDERLERİ(-) (66)",{"$f":"SUM(C46:C49)","v":0},{"$f":"SUM(D46:D49)","v":0},{"$f":"SUM(E46:E49)","v":0},{"$f":"SUM(F46:F49)","v":0}]
[null,"         1- KISA VADELİ BORÇLANMA GİDERLERİ (-)",{"$f":"SUM(D46:F46)","v":0}]
[null,"         2- UZUN VADELİ BORÇLANMA GİDERLERİ (-)",{"$f":"SUM(D47:F47)","v":0}]
[null,"         1- KISA VADELİ BORÇLANMA GİDERLERİ (-) (DAĞITIM)",null,{"$f":"C48*D2","v":0},{"$f":"C48*E2","v":0},{"$f":"C48*F2","v":0}]
[null,"         2- UZUN VADELİ BORÇLANMA GİDERLERİ (-) (DAĞITIM)",null,{"$f":"C49*D2","v":0},{"$f":"C49*E2","v":0},{"$f":"C49*F2","v":0}]
[null,"ARA TOPLAM",{"$f":"C44-C45","v":950000},{"$f":"D44-D45","v":1000000},{"$f":"E44-E45","v":0},{"$f":"F44-F45","v":-50000}]
[null,"I-OLAĞANDIŞI GELİR VE KÂRLAR (67)",{"$f":"SUM(D51:F51)","v":0},{"$f":"SUM(D52:D53)","v":0},{"$f":"SUM(E52:E53)","v":0},{"$f":"SUM(F52:F53)","v":0}]
[null,"1- ÖNCEKİ DÖNEM GELİR VE KARLARI (671)",{"$f":"SUM(D52:F52)","v":0}]
[null,"2-DİĞER OLAĞAN DIŞI GELİR VE KARLAR (679)",{"$f":"SUM(D53:F53)","v":0}]
[null,"ARA TOPLAM",{"$f":"SUM(D54:F54)","v":950000},{"$f":"D50+D51","v":1000000},{"$f":"E50+E51","v":0},-50000]
[null,"J-OLAĞANDIŞI GİDER VE ZARARLAR(-) (68)",{"$f":"SUM(C56:C58)","v":0},{"$f":"SUM(D56:D58)","v":0},{"$f":"SUM(E56:E58)","v":0},0]
[null,"1-Çalışmayan Kısım Gider ve Zararları(-) (680)",{"$f":"SUM(D56:F56)","v":0}]
[null,"2-Önceki Dönem Gider ve Zararları(-) (681)",{"$f":"SUM(D57:F57)","v":0}]
[null,"3-Diğer Olağan Dışı Gider ve Zararlar(-) (689)",0]
[null,"DÖNEM KÂRI VEYA ZARARI \n(TİCARİ BİLANÇO KARI ZARARI )",{"$f":"C54-C55","v":950000},{"$f":"D54-D55","v":1000000},{"$f":"E54-E55","v":0},-50000]
[null,"İHRACAT, İMALAT VE DİĞER FAALİYETLERDEN ELDE EDİLEN KAZANCIN TOPLAM TİCARİ KAZANÇ İÇİNDEKİ PAYLARI  \n\n(Kazançlar arasında Öncelik İhracat Kazancına Verilmiştir. İhrcat Kazancından arta kalan Ticari Kazanç İmalat ve Diğer Faaliyetlere Sayılmıştır.)\n\n",null,{"$f":"IF(D59>=$C$59,1,\n    IF(D59<=0,0,\n    IF(AND(D59>0,D59<$C$59),D59/$C$59)))","v":1},{"$f":"IF(E59>=$C$59,1,\n    IF(E59<=0,0,\n    IF(AND(E59>0,E59<$C$59),E59/$C$59)))","v":0},{"$f":"IF(F59>=$C$59,1,\n    IF(F59<=0,0,\n    IF(AND(F59>0,F59<$C$59),F59/$C$59)))","v":0}]
[null,null,null,{"$f":"D60/(D60+E60+F60)","v":1},{"$f":"E60/(D60+E60+F60)","v":0},{"$f":"F60/(D60+E60+F60)","v":0}]
[]
[null,"KKEG +",0]
[null," KABUL EDİLMEYEN GELİRLER -"]
[null,"ZARAR OLSA DAHİ İNDİRİLECEK İSTİSNALAR -",{"$f":"C66+C67+C68","v":0}]
[null,"Hizmet İhracatı Faaliyetinden (KVK 10-1/ğ) Elde Edilen Kazançlardan İstisna Edilenlerin Toplamı"]
[null,"İmalat Faaliyetinden Elde Edilen Kazançlardan İstisna Edilenlerin Toplamı"]
[null,"Diğer Faaliyetlerden Elde Edilen Kazançlardan İstisna Edilenlerin Toplamı"]
[null,"GEÇMİŞ YIL ZARARLARI -",750000]
[null,"İNDİRİMLER -",null,"AZAMİ YAZILABİLECEK İNDİRİMLER TUTARI",{"$f":"C59+C63-C64-C65-C69","v":200000}]
[]
[null,"1 PUAN İNDİRİM UYGULANACAK TUTARIN HESABINDA İSTİSNA KAZANÇLAR DÜŞÜLDÜKTEN SONRA BULUNAN TİCARİ KAZANÇ TUTARI İLE  İHRACAT,İMALAT VE DİĞER KAZANÇLARIN TUTARI","TİCARİ KAZANÇ TAN İhracat ve İmalat Kazancından İstisna Olan Tutarlar Düşüldükten Sonra Kalan Tutarı","İhracat Faaliyetinden Elde Edilen  Kazançtan İstisna Olan Kısım Düşüldükten Sonra Bulunan Tutarı","Üretim  Faaliyetinden Elde Edilen  Kazançtan İstisna Olan Kısım Düşüldükten Sonra Bulunan Tutarı","Diğer Faaliyetinden Elde Edilen  Kazanç"]
[null,null,{"$f":"IF(C59-C66-C67<=0,0,C59-C66-C67)","v":950000},{"$f":"IF($D$59-C66<=0,0,MIN($D$59-C66,$C$73*D61))","v":950000},{"$f":"IF($E$59-C67<=0,0,MIN($E$59-C67,$C$73*E61))","v":0},{"$f":"IF(C73-D73-E73<=0,0,C73-D73-E73)","v":0}]
[null,"MATRAH DAĞITIM PAYLARI",null,{"$f":"IFERROR(IF(D73/C73<=0,0,D73/C73),0)","v":1},{"$f":"IFERROR(IF(E73/C73<=0,0,E73/C73),0)","v":0},{"$f":"IFERROR(F73/C73,0)","v":0}]
[null,"İHRACAT, İMALAT VE DİĞER FAALİYETLERDEN ELDE EDİLEN KAZANCIN TOPLAM TİCARİ KAZANÇ İÇİNDEKİ PAYLARI ",null,{"$f":"IFERROR(IF(AND(D73+E73>C73, F73<=0),1,(D73+E73)/C73),0)","v":1},null,{"$f":"IFERROR(IF(F73<=0,0,F73/C73),0)","v":0}]
[null,"NEGATİF VE % 100 DEN BÜYÜKLÜK KONTROLÜ SONRASINDAKİ PAYLARI",null,{"$f":"IFERROR(IF(D75<=0,0,IF(D75>1,1,D75)),0)","v":1},null,{"$f":"IFERROR(IF(F75<=0,0,IF(F75>1,1,F75)),0)","v":0}]
[]
[null,"SAFİ KURUM KAZANCI \n(KURUMLAR VERGİSİ MATRAHI)",{"$f":"C59+C63-C64-C65-C69-C70","v":200000},{"$f":"IF(C78<0, \"ZARAR\",\"KAR\")","v":"KAR"}]
[]
[null,"2022 YILI 3. DÖNEM İNDİRİMLİ KURUMLAR VERGİSİ HESAPLAMA TABLOSU"]
[null,null,"1. TEŞVİK BELGESİ","2. TEŞVİK BELGESİ","3. TEŞVİK BELGESİ","4. TEŞVİK BELGESİ","5. TEŞVİK BELGESİ"]
[null,"Vergi İndirim Oranı (VİO)"]
[null,"KV MATRAHI (Safi Kurum Kazancı)",{"$f":"C78","v":200000}]
[null,"32/A  Uygulanacak K.V. Matrahı (HER BİR TEŞVİK BELGESİ KAPSAMINDA YARARLANILABİLECEK YATIRIMA KATKI TUTARININ MATRAHI BU HÜCRELERE YAZILMALIDIR)",null,null,null,null,null,{"$f":"IF(SUM(C84:G84)>C78,\"32/A İNDİRİMİ UYGULANACAK KAZANÇ, SAFİ KURUM KAZANCINDAN FAZLADIR\",SUM(C84:G84))","v":0}]
[null,"32/A UYGULANMAYACAK K.V.  Matrahı",{"$f":"IF(C83-(C84+D84+E84+F84+G84)<0,0,C83-(C84+D84+E84+F84+G84))","v":200000}]
[null,"MATRAH TOPLAMI",{"$f":"IF((C84+D84+E84+F84+G84+C85)>C78,C78,(C84+D84+E84+F84+G84+C85))","v":200000}]
[]
[null,"SAFİ KURUM KAZANCININ  KV VERGİ ORANLARI İTİBARİYLE DAĞILIMI ","TOPLAM SAFİ KAZANÇ","İhracat Kazancı Payı","Üretim Kazancı Payı","Diğer Faaliyet Kazancı Payı"]
[]
[null,null,{"$f":"C78","v":200000},{"$f":"IF(AND(AND($D$59>0,($D$59+$E$59)>=$C$59,D59>=C66),$C$90>=MAX(D59,D73)),\n\nMIN(MAX(IF(D59<=C90,D59,IF(D73<=C90,D73)),$C$90*D74)),\n\nIF(OR(D59<=0,D73<=0),0,\n\nMIN( MAX(   MAX(   IF(D59<=C90,D59),  IF(D73<=C90,D73) ),    MIN($C$90*D74,D59,D73)),$C$90)))","v":200000},{"$f":"MIN( IF(AND(AND($E$59>0,($D$59+$E$59)>=$C$59,E59>=C67),$C$90>=MAX(E59,E73)),\n\nMIN(MAX(IF(E59<=C90,E59,IF(E73<=C90,E73)),$C$90*E74)),\n\nIF(OR(E59<=0,E73<=0),0,\n\nMIN( MAX(   MAX(   IF(E59<=C90,E59),  IF(E73<=C90,E73) ),    MIN($C$90*E74,E59,E73)),$C$90))),C90-D90)","v":0},{"$f":"C90-D90-E90","v":0}]
[null,"SAFİ KURUM KAZANCININ DAĞILIMI ORANSAL DAĞILIMI",{"$f":"C90","v":200000},{"$f":"D90/C90","v":1},{"$f":"E90/C90","v":0},{"$f":"F90/C90","v":0}]
[null,"SAFİ KURUM KAZANCININ DAĞILIMI TUTARSAL",{"$f":"C91","v":200000},{"$f":"D90","v":200000},{"$f":"E90","v":0},{"$f":"F90","v":0}]
[null,"SAFİ KURUM KAZANCI DAĞILIMI",{"$f":"C92","v":200000},{"$f":"IFERROR(IF(D92/C92>=1,1,D92/C92),0)","v":1},{"$f":"IFERROR(IF(E92/C92>=1,1,E92/C92),0)","v":0},{"$f":"IFERROR(IF(F92/C92>=1,1,F92/C92),0)","v":0},null,"KV ORANI"]
[null,"1 PUAN VE 32/A İNDİRİMİ OLMASAYDI HESAPLANAN KV TUTARI",{"$f":"C93*$H$94","v":50000},{"$f":"D92*$H$94","v":50000},{"$f":"E92*$H$94","v":0},{"$f":"F92*$H$94","v":0},null,0.25]
[null,"32/ A UYGULANAN MATRAH",{"$f":"C84+D84+E84+F84+G84","v":0},{"$f":"D107+D112+D117+D122+D127","v":0},{"$f":"D106+D111+D116+D121+D126","v":0},{"$f":"D105+D110+D115+D120+D125","v":0}]
[null,"32/A UYGULANACAK MATRAH ÜZERİNDEN ÖDENECEK KV TUTARI",{"$f":"J108+J113+J118+J123+J128","v":0},{"$f":"J107+J112+J117+J122+J127","v":0},{"$f":"J106+J111+J116+J121+J126","v":0},{"$f":"J105+J110+J115+J120+J125","v":0}]
[null,"32/A UYGULANMAYAN MATRAH",{"$f":"IF(C85<=0,0,C85)","v":200000},{"$f":"D132","v":200000},{"$f":"D131","v":0},{"$f":"D130","v":0}]
[null,"32/A UYGULANMAYAN MATRAH ÜZERİNDEN ÖDENECEK KV TUTARI",{"$f":"L130","v":40000},{"$f":"J132","v":40000},{"$f":"J131","v":0},{"$f":"J130","v":0}]
[null,"TOPLAM ÖDENECEK KV",{"$f":"C96+C98","v":40000},{"$f":"J132+J107","v":40000},{"$f":"J131+J106","v":0},{"$f":"J130+J105","v":0}]
[null,"TOPLAM AVANTAJ  (YARARLANILAN 1 PUAN İNDİRİMİ + 32/A İNDİRİMİ TUTARI )",{"$f":"C94-C99","v":10000},{"$f":"D101+D102","v":10000},{"$f":"E101+E102","v":0},{"$f":"F101+F102","v":0}]
[null,"YARARLANILAN 1 - 5 PUAN İNDİRİMİ TUTARI",{"$f":"F133+F128+F123+F118+F113+F108","v":10000},{"$f":"F132+F107+F112+F117+F122+F127","v":10000},{"$f":"F131+F106+F111+F116+F121+F126","v":0},{"$f":"F130+F105+F110+F115+F120+F125","v":0}]
[null,"YARLANILAN 32/A İNDİRİMİ TUTARI",{"$f":"K108+K113+K118+K123+K128+K133","v":0},{"$f":"K107+K112+K122+K127+K132","v":0},{"$f":"K106+K111+K116+K121+K126+K131","v":0},{"$f":"K105++K110+K115+K120+K125+K130","v":0}]
[]
[null,"32/A UYGULANABİLECEK MATRAH (1.TEŞVİK BELGESİ)",{"$f":"C84","v":0},"KV MATRAHI","1 - 5 PUAN İNDİRİM OLMASAYDI HESAPLANAN KV TUTARI","1 -5 Puan İndirim Tutarı","1 - 5 Puan İndirim Sonrasında Hesaplanan KV Tutarı","32/A İndirimi Olmasaydı Ödenecek KV Tutarı","1 -5 Puan İndirim ve 32/A VİO Uygulandıktan Sonra Tatbik Edilecek KV Oranı","1 -5 Puan İndirim ve 32/A İndirimi Uygulandıktan Sonra Ödenecek  KV Tutarı","Yararlanılan Yatırıma Katkı Tutarı\n(32/A İnd. KV Nedeniyle Vazgeçilen Vergi Tutarı)","Ödenecek KV Tutarı"]
[null,"GENEL ORANA TABİ KISIM (DİĞER FAALİYETLER)",{"$f":"F93","v":0},{"$f":"C104*C105","v":0},{"$f":"D105*$H$94","v":0},0,{"$f":"E105-F105","v":0},{"$f":"G105","v":0},{"$f":"($H$94)-(($H$94)*$C$82)","v":0.25},{"$f":"I105*D105","v":0},{"$f":"G105-J105","v":0},{"$f":"J108","v":0}]
[null,"1 PUAN İNDİRİMLİ ORANA TABİ KISIM  (İMALAT)",{"$f":"E93","v":0},{"$f":"C104*C106","v":0},{"$f":"D106*$H$94","v":0},{"$f":"D106/100","v":0},{"$f":"E106-F106","v":0},{"$f":"G106","v":0},{"$f":"($H$94-0.01)-(($H$94-0.01)*$C$82)","v":0.24},{"$f":"I106*D106","v":0},{"$f":"G106-J106","v":0}]
[null,"5 PUAN İNDİRİMLİ ORANA TABİ KISIM  ( İHRACAT)",{"$f":"D93","v":1},{"$f":"C104*C107","v":0},{"$f":"D107*$H$94","v":0},{"$f":"D107/20","v":0},{"$f":"E107-F107","v":0},0,{"$f":"($H$94-0.05)-(($H$94-0.05)*C82)","v":0.2},0,{"$f":"G107-J107","v":0}]
[null,"TOPLAM",{"$f":"SUM(C105:C107)","v":1},{"$f":"SUM(D105:D107)","v":0},0,{"$f":"SUM(F105:F107)","v":0},{"$f":"SUM(G105:G107)","v":0},{"$f":"SUM(H105:H107)","v":0},null,0,0]
[null,"32/A UYGULANABİLECEK MATRAH (2.TEŞVİK BELGESİ)",{"$f":"D84","v":0},"KV MATRAHI","1 - 5 PUAN İNDİRİM OLMASAYDI HESAPLANAN KV TUTARI","1 -5 Puan İndirim Tutarı","1 -5 Puan İndirim Sonrasında Hesaplanan KV Tutarı","32/A İndirimi Olmasaydı Ödenecek KV Tutarı","1 - 5 Puan İndirim ve 32/A VİO Uygulandıktan Sonra Tatbik Edilecek KV Oranı","1-5  Puan İndirim ve 32/A İndirimi Uygulandıktan Sonra Ödenecek  KV Tutarı","Yararlanılan Yatırıma Katkı Tutarı\n(32/A İnd. KV Nedeniyle Vazgeçilen Vergi Tutarı)","Ödenecek KV Tutarı"]
[null,"GENEL ORANA TABİ KISIM (DİĞER FAALİYETLER)",{"$f":"F93","v":0},{"$f":"C109*C110","v":0},{"$f":"D110*$H$94","v":0},0,{"$f":"E110-F110","v":0},{"$f":"G110","v":0},{"$f":"($H$94)-(($H$94)*D82)","v":0.25},{"$f":"I110*D110","v":0},{"$f":"G110-J110","v":0},{"$f":"J113","v":0}]
[null,"1 PUAN İNDİRİMLİ ORANA TABİ KISIM  (İMALAT)",{"$f":"E93","v":0},{"$f":"C109*C111","v":0},{"$f":"D111*$H$94","v":0},{"$f":"D111/100","v":0},{"$f":"E111-F111","v":0},{"$f":"G111","v":0},{"$f":"($H$94-0.01)-(($H$94-0.01)*D82)","v":0.24},{"$f":"I111*D111","v":0},{"$f":"G111-J111","v":0}]
[null,"5 PUAN İNDİRİMLİ ORANA TABİ KISIM  ( İHRACAT)",{"$f":"D93","v":1},{"$f":"C109*C112","v":0},{"$f":"D112*$H$94","v":0},{"$f":"D112/20","v":0},{"$f":"E112-F112","v":0},0,{"$f":"($H$94-0.05)-(($H$94-0.05)*D82)","v":0.2},0,{"$f":"G112-J112","v":0}]
[null,"TOPLAM",{"$f":"SUM(C110:C112)","v":1},0,0,{"$f":"SUM(F110:F112)","v":0},{"$f":"SUM(G110:G112)","v":0},{"$f":"SUM(H110:H112)","v":0},null,{"$f":"SUM(J110:J112)","v":0},0]
[null,"32/A UYGULANABİLECEK MATRAH (3.TEŞVİK BELGESİ)",{"$f":"E84","v":0},"KV MATRAHI","1 - 5 PUAN İNDİRİM OLMASAYDI HESAPLANAN KV TUTARI","1-5 Puan İndirim Tutarı","1 - 5 Puan İndirim Sonrasında Hesaplanan KV Tutarı","32/A İndirimi Olmasaydı Ödenecek KV Tutarı","1 - 5 Puan İndirim ve 32/A VİO Uygulandıktan Sonra Tatbik Edilecek KV Oranı","1 -5 Puan İndirim ve 32/A İndirimi Uygulandıktan Sonra Ödenecek  KV Tutarı","Yararlanılan Yatırıma Katkı Tutarı\n(32/A İnd. KV Nedeniyle Vazgeçilen Vergi Tutarı)","Ödenecek KV Tutarı"]
[null,"GENEL ORANA TABİ KISIM (DİĞER FAALİYETLER)",{"$f":"F93","v":0},{"$f":"C114*C115","v":0},{"$f":"D115*$H$94","v":0},0,{"$f":"E115-F115","v":0},{"$f":"G115","v":0},{"$f":"($H$94)-(($H$94)*E82)","v":0.25},{"$f":"I115*D115","v":0},{"$f":"G115-J115","v":0},{"$f":"J118","v":0}]
[null,"1 PUAN İNDİRİMLİ ORANA TABİ KISIM  (İMALAT)",{"$f":"E93","v":0},{"$f":"C114*C116","v":0},{"$f":"D116*$H$94","v":0},{"$f":"D116/100","v":0},{"$f":"E116-F116","v":0},{"$f":"G116","v":0},{"$f":"($H$94-0.01)-(($H$94-0.01)*E82)","v":0.24},{"$f":"I116*D116","v":0},{"$f":"G116-J116","v":0}]
[null,"5 PUAN İNDİRİMLİ ORANA TABİ KISIM  ( İHRACAT)",{"$f":"D93","v":1},{"$f":"C114*C117","v":0},{"$f":"D117*$H$94","v":0},{"$f":"D117/20","v":0},{"$f":"E117-F117","v":0},0,{"$f":"($H$94-0.05)-(($H$94-0.05)*E82)","v":0.2},0,{"$f":"G117-J117","v":0}]
[null,"TOPLAM",{"$f":"SUM(C115:C117)","v":1},0,0,{"$f":"SUM(F115:F117)","v":0},{"$f":"SUM(G115:G117)","v":0},{"$f":"SUM(H115:H117)","v":0},null,{"$f":"SUM(J115:J117)","v":0},0]
[null,"32/A UYGULANABİLECEK MATRAH (4. TEŞVİK BELGESİ)",{"$f":"F84","v":0},"KV MATRAHI","1 - 5 PUAN İNDİRİM OLMASAYDI HESAPLANAN KV TUTARI","1-5 Puan İndirim Tutarı","1 -5 Puan İndirim Sonrasında Hesaplanan KV Tutarı","32/A İndirimi Olmasaydı Ödenecek KV Tutarı","1- 5  Puan İndirim ve 32/A VİO Uygulandıktan Sonra Tatbik Edilecek KV Oranı","1-5 Puan İndirim ve 32/A İndirimi Uygulandıktan Sonra Ödenecek  KV Tutarı","Yararlanılan Yatırıma Katkı Tutarı\n(32/A İnd. KV Nedeniyle Vazgeçilen Vergi Tutarı)","Ödenecek KV Tutarı"]
[null,"GENEL ORANA TABİ KISIM (DİĞER FAALİYETLER)",{"$f":"F93","v":0},{"$f":"C119*C120","v":0},{"$f":"D120*$H$94","v":0},0,{"$f":"E120-F120","v":0},{"$f":"G120","v":0},{"$f":"($H$94)-(($H$94)*F82)","v":0.25},{"$f":"I120*D120","v":0},{"$f":"G120-J120","v":0},{"$f":"J123","v":0}]
[null,"1 PUAN İNDİRİMLİ ORANA TABİ KISIM  (İMALAT)",{"$f":"E93","v":0},{"$f":"C119*C121","v":0},{"$f":"D121*$H$94","v":0},{"$f":"D121/100","v":0},{"$f":"E121-F121","v":0},{"$f":"G121","v":0},{"$f":"($H$94-0.01)-(($H$94-0.01)*F82)","v":0.24},{"$f":"I121*D121","v":0},{"$f":"G121-J121","v":0}]
[null,"5 PUAN İNDİRİMLİ ORANA TABİ KISIM  ( İHRACAT)",{"$f":"D93","v":1},{"$f":"C119*C122","v":0},{"$f":"D122*$H$94","v":0},{"$f":"D122/20","v":0},{"$f":"E122-F122","v":0},0,{"$f":"($H$94-0.05)-(($H$94-0.05)*F82)","v":0.2},0,{"$f":"G122-J122","v":0}]
[null,"TOPLAM",{"$f":"SUM(C120:C122)","v":1},0,0,{"$f":"SUM(F120:F122)","v":0},{"$f":"SUM(G120:G122)","v":0},{"$f":"SUM(H120:H122)","v":0},null,{"$f":"SUM(J120:J122)","v":0},0]
[null,"32/A UYGULANABİLECEK MATRAH (5.TEŞVİK BELGESİ)",{"$f":"G84","v":0},"KV MATRAHI","1 - 5 PUAN İNDİRİM OLMASAYDI HESAPLANAN KV TUTARI","1-5 Puan İndirim Tutarı","1 - 5 Puan İndirim Sonrasında Hesaplanan KV Tutarı","32/A İndirimi Olmasaydı Ödenecek KV Tutarı","1 -5 Puan İndirim ve 32/A VİO Uygulandıktan Sonra Tatbik Edilecek KV Oranı","1 - 5 Puan İndirim ve 32/A İndirimi Uygulandıktan Sonra Ödenecek  KV Tutarı","Yararlanılan Yatırıma Katkı Tutarı\n(32/A İnd. KV Nedeniyle Vazgeçilen Vergi Tutarı)","Ödenecek KV Tutarı"]
[null,"GENEL ORANA TABİ KISIM (DİĞER FAALİYETLER)",{"$f":"F93","v":0},{"$f":"C124*C125","v":0},{"$f":"D125*$H$94","v":0},0,{"$f":"E125-F125","v":0},{"$f":"G125","v":0},{"$f":"($H$94)-(($H$94)*G82)","v":0.25},{"$f":"I125*D125","v":0},{"$f":"G125-J125","v":0},{"$f":"J128","v":0}]
[null,"1 PUAN İNDİRİMLİ ORANA TABİ KISIM  (İMALAT)",{"$f":"E93","v":0},{"$f":"C124*C126","v":0},{"$f":"D126*$H$94","v":0},{"$f":"D126/100","v":0},{"$f":"E126-F126","v":0},{"$f":"G126","v":0},{"$f":"($H$94-0.01)-(($H$94-0.01)*G82)","v":0.24},{"$f":"I126*D126","v":0},{"$f":"G126-J126","v":0}]
[null,"5 PUAN İNDİRİMLİ ORANA TABİ KISIM  ( İHRACAT)",{"$f":"D93","v":1},{"$f":"C124*C127","v":0},{"$f":"D127*$H$94","v":0},{"$f":"D127/20","v":0},{"$f":"E127-F127","v":0},0,{"$f":"($H$94-0.05)-(($H$94-0.05)*G82)","v":0.2},0,{"$f":"G127-J127","v":0}]
[null,"TOPLAM",{"$f":"SUM(C125:C127)","v":1},0,0,{"$f":"SUM(F125:F127)","v":0},{"$f":"SUM(G125:G127)","v":0},{"$f":"SUM(H125:H127)","v":0},null,{"$f":"SUM(J125:J127)","v":0},0]
[null,"32/A UYGULANAMAYACAK MATRAH",{"$f":"IF(C85<=0,0,C85)","v":200000},"KV MATRAHI","1-5 PUAN İNDİRİM OLMASAYDI HESAPLANAN KV TUTARI","1-5 Puan İndirim Tutarı","1 -5 Puan İndirim Sonrasında Hesaplanan KV Tutarı","32/A İNDİRİMİ UYGULANMAZ",null,"1 Puan İndirim ve 32/A İndirimi Uygulandıktan Sonra Ödenecek  KV Tutarı","Yararlanılan Yatırıma Katkı Tutarı\n(32/A İnd. KV Nedeniyle Vazgeçilen Vergi Tutarı)","Ödenecek KV Tutarı"]
[null,"GENEL ORANA TABİ KISIM (DİĞER FAALİYETLER)",{"$f":"F93","v":0},{"$f":"C129*C130","v":0},{"$f":"D130*$H$94","v":0},0,{"$f":"E130-F130","v":0},null,null,{"$f":"G130","v":0},{"$f":"G130-J130","v":0},{"$f":"J133","v":40000}]
[null,"1 PUAN İNDİRİMLİ ORANA TABİ KISIM  (İMALAT)",{"$f":"E93","v":0},{"$f":"C131*C129","v":0},{"$f":"D131*$H$94","v":0},{"$f":"D131/100","v":0},{"$f":"E131-F131","v":0},null,null,{"$f":"G131","v":0},{"$f":"G131-J131","v":0}]
[null,"5 PUAN İNDİRİMLİ ORANA TABİ KISIM  ( İHRACAT)",{"$f":"D93","v":1},{"$f":"C132*C129","v":200000},{"$f":"D132*$H$94","v":50000},{"$f":"D132/20","v":10000},{"$f":"E132-F132","v":40000},null,null,40000,0]
[null,"TOPLAM",{"$f":"SUM(C130:C132)","v":1},{"$f":"SUM(D130:D132)","v":200000},50000,{"$f":"SUM(F130:F132)","v":10000},{"$f":"SUM(G130:G132)","v":40000},null,null,40000,0]
[null,"TOPLAM KV MATRAHI VE ÖDENMESİ GEREKEN KV ",{"$f":"C104+C129+C109+C114+C119+C124","v":200000},{"$f":"D108+D133+D113+D118+D123+D128","v":200000},{"$f":"E108+E133+E113+E118+E123+E128","v":50000},{"$f":"F108+F133+F113+F118+F123+F128","v":10000},{"$f":"G108+G133+G113+G118+G123+G128","v":40000},null,null,{"$f":"J108+J133+J113+J118+J123+J128","v":40000},{"$f":"K133+K108+K113+K118+K123+K128","v":0},{"$f":"L105+L130+L110+L115+L120+L125","v":40000}]
[]
[null,"GEÇİCİ VERGİ BEYANNMESİNDE MATRAH BİLDİRİMİ BÖLÜMÜNDE DOLDURULACAK KISIMLAR VE TUTARLARI"]
[null,"32 A Madde Kapsamında İndirimli Kurumlar Vergisine (Geçici Vergiye) Tabi Matrah",{"$f":"C104+C109+C114+C119+C124","v":0},{"$f":"E108+E113+E118+E123+E128","v":0},"1-5 Puan Olmasaydı Hesaplan KV Tutarı"]
[null,null,null,{"$f":"G108+G113+G118+G123++G128","v":0},"1 -5 Puan İndirim Sonrasında Ödenecek KV Tutarı\n (32 A olmasaydı hesaplanacak Vergi)"]
[null,null,null,{"$f":"K108+K113+K118+K123+K128","v":0},"32/A İndirimi ile Vazgeçilen Vergi"]
[null,"32 A Madde Kapsamında İndirimli Kurumlar Vergisi(Geçici Vergi) Oranı",{"$f":"IFERROR(D140/C137,0)","v":0},{"$f":"L105+L110+L115+L120+L125","v":0},"32/A ya Tabi Matrah Üzerinden Ödenecek KV"]
[null,"32/7 Madde Kapsamında İndirimli Kurumlar Vergisine (Geçici Vergiye) Tabi Matrah  (İhracat)",{"$f":"D132","v":200000},{"$f":"E132","v":50000},"5 Puan Olmasaydı Hesaplan KV Tutarı"]
[null,null,null,{"$f":"F132","v":10000},"5 Puan İndirimin Vergi Etkisi "]
[null,"32/7 Madde Kapsamında İndirimli Kurumlar Vergisi (Geçici Vergi) Oranı",{"$f":"IFERROR(D143/C141,0)","v":0.2},{"$f":"G132","v":40000},"5 Puan İndirim Sonrasında Ödenecek KV Tutarı (İhracat)\n"]
[null,"32/8 Madde Kapsamında İndirimli Kurumlar Vergisine (Geçici Vergiye) Tabi Matrah  (Üretim)",{"$f":"D131","v":0},{"$f":"E131","v":0},"1 Puan Olmasaydı Hesaplan KV Tutarı"]
[null,null,null,{"$f":"F131","v":0},"1 Puan İndirimin Vergi Etkisi "]
[null,"32/8 Madde Kapsamında İndirimli Kurumlar Vergisi (Geçici Vergi) Oranı",{"$f":"IFERROR(D146/C144,0)","v":0},{"$f":"G131","v":0},"1 Puan İndirim Sonrasında Ödenecek KV Tutarı (Üretim)\n"]
[null,"Genel Orana Tabi Matrah (Diğer)",{"$f":"D130","v":0},{"$f":"J130","v":0},"Diğer Faalilyetlerden Elde Edilen Kazanç"]
[null,null,{"$f":"IFERROR(D147/C147,0)","v":0}]
[null,"MATRAHLAR TOPLAMI",{"$f":"C137+C144+C141+C147","v":200000},{"$f":"D140+D146+D143+D147","v":40000}]

{"sheet":"İ Ö 5","index":6,"n_rows":149,"n_cols":12,"rows_kept":149,"cut":false,"hidden":true,"merged":[[84,2,84,6],[1,1,2,1],[59,1,59,2],[60,1,60,2],[71,1,72,1],[73,1,73,2],[74,1,74,2],[74,3,74,4],[75,1,75,2],[75,3,75,4],[79,1,79,3],[82,2,82,6],[85,2,85,6],[87,1,89,1],[87,2,88,2],[87,3,88,3],[87,4,88,4],[87,5,88,5],[135,1,135,4],[137,1,138,2],[104,11,107,11],[109,11,112,11],[114,11,117,11],[119,11,122,11],[124,11,127,11],[128,7,133,8],[129,11,132,11]]}
[]
[null,"FAALİYET TÜRLERİ İTİBARİYLE HASILATLAR VE TOPLAM İÇİNDEKİ ORANLARI",{"$f":"IFERROR(C4/C4,0)","v":1},{"$f":"IFERROR(D4/C4,0)","v":0.1},{"$f":"IFERROR(E4/C4,0)","v":0},{"$f":"IFERROR(F4/C4,0)","v":0.9}]
[null,null,"Toplam Hasılat","İhracat faaliyeti","İmalat faaliyeti","Diğer faaliyetler"]
[null,"A-BRÜT SATIŞLAR (60)",{"$f":"D4+E4+F4","v":50000000},{"$f":"SUM(D5:D7)","v":5000000},{"$f":"SUM(E5:E7)","v":0},45000000]
[null,"1-Yurtiçi Satışlar (600)",{"$f":"D5+E5+F5","v":45000000},null,null,45000000]
[null,"2-Yurtdışı Satışlar (601)",{"$f":"D6+E6+F6","v":5000000},5000000]
[null,"3-Diğer Gelirler (602)",{"$f":"D7+E7+F7","v":0}]
[null,"B-SATIŞ İNDİRİMLERİ(-) (61)",{"$f":"SUM(C9:C11)","v":0},{"$f":"SUM(D9:D11)","v":0},{"$f":"SUM(E9:E11)","v":0},0]
[null,"1-Satıştan İadeler (-) (610)",{"$f":"SUM(D9:F9)","v":0}]
[null,"2- Satış İskontoları (-) (611)",{"$f":"SUM(D10:F10)","v":0}]
[null,"3-Diğer İndirimler (-) (612)",0]
[null,"C-NET SATIŞLAR",{"$f":"C4-C8","v":50000000},{"$f":"D4-D8","v":5000000},{"$f":"E4-E8","v":0},45000000]
[null,"D-SATIŞLARIN MALİYETİ (-) (62)",{"$f":"SUM(C14:C17)","v":0},{"$f":"SUM(D14:D17)","v":0},{"$f":"SUM(E14:E17)","v":0},{"$f":"SUM(F14:F17)","v":0}]
[null,"1-Satılan Mamuller Maliyeti ( 620)",{"$f":"SUM(D14:F14)","v":0}]
[null,"2-Satılan Ticari Mal Maliyeti (621)",{"$f":"SUM(D15:F15)","v":0}]
[null,"3-Satılan Hizmet Maliyeti (622)",0]
[null,"4-Diğer Satışların Maliyeti (623)",0]
[null,"BRÜT SATIŞ KARI / ZARARI",{"$f":"C12-C13","v":50000000},{"$f":"D12-D13","v":5000000},{"$f":"E12-E13","v":0},45000000]
[null,"E-FAALİYET GİDERLERİ (-) (63)",{"$f":"SUM(C20:C24)","v":0},{"$f":"SUM(D20:D24)","v":0},{"$f":"SUM(E20:E24)","v":0},0]
[null,"1-Araştırma ve Geliştirme Giderleri(-) (630)",{"$f":"SUM(D20:F20)","v":0}]
[null,"2-Pazarlama, Satış ve Dağıtım Giderleri(-) (631)",{"$f":"SUM(D21:F21)","v":0}]
[null,"3-Genel Yönetim Giderleri(-) (632)",{"$f":"SUM(D22:F22)","v":0}]
[null,"MÜŞTEREK GENEL GİDERLER (DAĞITIM-HASILAT PAYINA GÖRE)",null,{"$f":"C23*D2","v":0},{"$f":"C23*E2","v":0},{"$f":"C23*F2","v":0}]
[null,"MÜŞTEREK GENEL GİDER GİBİ DAĞITIMA TABİ TUTULACAK AMORTİSMAN GİDERLERİ  (DAĞITIM-HASILAT PAYINA GÖRE)",null,{"$f":"C24*D2","v":0},{"$f":"C24*E2","v":0},{"$f":"C24*F2","v":0}]
[null,"FAALİYET KARI / ZARARI ",{"$f":"C18-C19","v":50000000},{"$f":"D18-D19","v":5000000},{"$f":"E18-E19","v":0},45000000]
[null,"F-DİĞER FAALİYETLERDEN OLAĞAN GELİR VE KARLAR (64)",{"$f":"SUM(C27:C35)","v":0},{"$f":"SUM(D27:D35)","v":0},{"$f":"SUM(E27:E35)","v":0},{"$f":"SUM(F27:F35)","v":0}]
[null,"         1- İŞTİRAKLERDEN TEMETTÜ GELİRLERİ (640)",{"$f":"SUM(D27:F27)","v":0}]
[null,"         2- BAĞLI ORTAKLIKLARDAN TEMETTÜ GELİRLERİ (641)",{"$f":"SUM(D28:F28)","v":0}]
[null,"         3- FAİZ GELİRLERİ (642) (ihracat ve imalat kaynaklı alacağın tahsiline kadar olan süreçte oluşan)",0]
[null,"         4- KOMİSYON GELİRLERİ (643)",0]
[null,"         5- KONUSU OLMAYAN KARŞILIKLAR (644)",0]
[null,"         6- MENKUL KIYMET SATIŞ KARLARI (645)",0]
[null,"         7- KAMBİYO KARLARI (646) (ihracat ve imalat kaynaklı alacağın tahsiline kadar olan süreçte oluşan)",0]
[null,"         8- REESKONT FAİZ GELİRLERİ (647)",0]
[null,"         9- FAALİYETLE İLGİLİ DİĞER GELİR VE KARLAR (649)",0]
[null,"ARA TOPLAM",{"$f":"C25+C26","v":50000000},{"$f":"D25+D26","v":5000000},{"$f":"E25+E26","v":0},{"$f":"F25+F26","v":45000000}]
[null,"G-DİĞER FAALİYETLERDEN OLAĞAN GİDER VE ZARARLAR(-) (65)",{"$f":"SUM(C38:C43)","v":0},{"$f":"SUM(D38:D43)","v":0},{"$f":"SUM(E38:E43)","v":0},0]
[null,"         1- KOMİSYON GİDERLERİ (653)",{"$f":"SUM(D38:F38)","v":0}]
[null,"         2- KARŞILIK GİDERLERİ (654)",{"$f":"SUM(D39:F39)","v":0}]
[null,"         3- MENKUL KIYMET SATIŞ ZARARLARI (655)",0]
[null,"         4- KAMBİYO ZARARLARI (656) (ihracat ve imalat kaynaklı alacağın tahsiline kadar olan süreçte oluşan)",0]
[null,"         5- REESKONT FAİZ GİDERLERİ (657)",0]
[null,"         6- DİĞER OLAĞAN GİDER VE ZARARLAR (659)",{"$f":"SUM(D43:F43)","v":0}]
[null,"ARA TOPLAM",{"$f":"C36-C37","v":50000000},{"$f":"D36-D37","v":5000000},{"$f":"E36-E37","v":0},45000000]
[null,"H-FİNANSMAN GİDERLERİ(-) (66)",{"$f":"SUM(C46:C49)","v":0},{"$f":"SUM(D46:D49)","v":0},{"$f":"SUM(E46:E49)","v":0},{"$f":"SUM(F46:F49)","v":0}]
[null,"         1- KISA VADELİ BORÇLANMA GİDERLERİ (-)",{"$f":"SUM(D46:F46)","v":0}]
[null,"         2- UZUN VADELİ BORÇLANMA GİDERLERİ (-)",{"$f":"SUM(D47:F47)","v":0}]
[null,"         1- KISA VADELİ BORÇLANMA GİDERLERİ (-) (DAĞITIM)",null,{"$f":"C48*D2","v":0},{"$f":"C48*E2","v":0},{"$f":"C48*F2","v":0}]
[null,"         2- UZUN VADELİ BORÇLANMA GİDERLERİ (-) (DAĞITIM)",null,{"$f":"C49*D2","v":0},{"$f":"C49*E2","v":0},{"$f":"C49*F2","v":0}]
[null,"ARA TOPLAM",{"$f":"C44-C45","v":50000000},{"$f":"D44-D45","v":5000000},{"$f":"E44-E45","v":0},{"$f":"F44-F45","v":45000000}]
[null,"I-OLAĞANDIŞI GELİR VE KÂRLAR (67)",{"$f":"SUM(D51:F51)","v":0},{"$f":"SUM(D52:D53)","v":0},{"$f":"SUM(E52:E53)","v":0},{"$f":"SUM(F52:F53)","v":0}]
[null,"1- ÖNCEKİ DÖNEM GELİR VE KARLARI (671)",{"$f":"SUM(D52:F52)","v":0}]
[null,"2-DİĞER OLAĞAN DIŞI GELİR VE KARLAR (679)",{"$f":"SUM(D53:F53)","v":0}]
[null,"ARA TOPLAM",{"$f":"SUM(D54:F54)","v":50000000},{"$f":"D50+D51","v":5000000},{"$f":"E50+E51","v":0},45000000]
[null,"J-OLAĞANDIŞI GİDER VE ZARARLAR(-) (68)",{"$f":"SUM(C56:C58)","v":0},{"$f":"SUM(D56:D58)","v":0},{"$f":"SUM(E56:E58)","v":0},0]
[null,"1-Çalışmayan Kısım Gider ve Zararları(-) (680)",{"$f":"SUM(D56:F56)","v":0}]
[null,"2-Önceki Dönem Gider ve Zararları(-) (681)",{"$f":"SUM(D57:F57)","v":0}]
[null,"3-Diğer Olağan Dışı Gider ve Zararlar(-) (689)",0]
[null,"DÖNEM KÂRI VEYA ZARARI \n(TİCARİ BİLANÇO KARI ZARARI )",{"$f":"C54-C55","v":50000000},{"$f":"D54-D55","v":5000000},{"$f":"E54-E55","v":0},45000000]
[null,"İHRACAT, İMALAT VE DİĞER FAALİYETLERDEN ELDE EDİLEN KAZANCIN TOPLAM TİCARİ KAZANÇ İÇİNDEKİ PAYLARI  \n\n(Kazançlar arasında Öncelik İhracat Kazancına Verilmiştir. İhrcat Kazancından arta kalan Ticari Kazanç İmalat ve Diğer Faaliyetlere Sayılmıştır.)\n\n",null,{"$f":"IF(D59>=$C$59,1,\n    IF(D59<=0,0,\n    IF(AND(D59>0,D59<$C$59),D59/$C$59)))","v":0.1},{"$f":"IF(E59>=$C$59,1,\n    IF(E59<=0,0,\n    IF(AND(E59>0,E59<$C$59),E59/$C$59)))","v":0},{"$f":"IF(F59>=$C$59,1,\n    IF(F59<=0,0,\n    IF(AND(F59>0,F59<$C$59),F59/$C$59)))","v":0.9}]
[null,null,null,{"$f":"D60/(D60+E60+F60)","v":0.1},{"$f":"E60/(D60+E60+F60)","v":0},{"$f":"F60/(D60+E60+F60)","v":0.9}]
[]
[null,"KKEG +",2000000]
[null," KABUL EDİLMEYEN GELİRLER -"]
[null,"ZARAR OLSA DAHİ İNDİRİLECEK İSTİSNALAR -",{"$f":"C66+C67+C68","v":12000000}]
[null,"Hizmet İhracatı Faaliyetinden (KVK 10-1/ğ) Elde Edilen Kazançlardan İstisna Edilenlerin Toplamı"]
[null,"İmalat Faaliyetinden Elde Edilen Kazançlardan İstisna Edilenlerin Toplamı"]
[null,"Diğer Faaliyetlerden Elde Edilen Kazançlardan İstisna Edilenlerin Toplamı",12000000]
[null,"GEÇMİŞ YIL ZARARLARI -",0]
[null,"İNDİRİMLER -",null,"AZAMİ YAZILABİLECEK İNDİRİMLER TUTARI",{"$f":"C59+C63-C64-C65-C69","v":40000000}]
[]
[null,"1 PUAN İNDİRİM UYGULANACAK TUTARIN HESABINDA İSTİSNA KAZANÇLAR DÜŞÜLDÜKTEN SONRA BULUNAN TİCARİ KAZANÇ TUTARI İLE  İHRACAT,İMALAT VE DİĞER KAZANÇLARIN TUTARI","TİCARİ KAZANÇ TAN İhracat ve İmalat Kazancından İstisna Olan Tutarlar Düşüldükten Sonra Kalan Tutarı","İhracat Faaliyetinden Elde Edilen  Kazançtan İstisna Olan Kısım Düşüldükten Sonra Bulunan Tutarı","Üretim  Faaliyetinden Elde Edilen  Kazançtan İstisna Olan Kısım Düşüldükten Sonra Bulunan Tutarı","Diğer Faaliyetinden Elde Edilen  Kazanç"]
[null,null,{"$f":"IF(C59-C66-C67<=0,0,C59-C66-C67)","v":50000000},{"$f":"IF($D$59-C66<=0,0,MIN($D$59-C66,$C$73*D61))","v":5000000},{"$f":"IF($E$59-C67<=0,0,MIN($E$59-C67,$C$73*E61))","v":0},{"$f":"IF(C73-D73-E73<=0,0,C73-D73-E73)","v":45000000}]
[null,"MATRAH DAĞITIM PAYLARI",null,{"$f":"IFERROR(IF(D73/C73<=0,0,D73/C73),0)","v":0.1},{"$f":"IFERROR(IF(E73/C73<=0,0,E73/C73),0)","v":0},{"$f":"IFERROR(F73/C73,0)","v":0.9}]
[null,"İHRACAT, İMALAT VE DİĞER FAALİYETLERDEN ELDE EDİLEN KAZANCIN TOPLAM TİCARİ KAZANÇ İÇİNDEKİ PAYLARI ",null,{"$f":"IFERROR(IF(AND(D73+E73>C73, F73<=0),1,(D73+E73)/C73),0)","v":0.1},null,{"$f":"IFERROR(IF(F73<=0,0,F73/C73),0)","v":0.9}]
[null,"NEGATİF VE % 100 DEN BÜYÜKLÜK KONTROLÜ SONRASINDAKİ PAYLARI",null,{"$f":"IFERROR(IF(D75<=0,0,IF(D75>1,1,D75)),0)","v":0.1},null,{"$f":"IFERROR(IF(F75<=0,0,IF(F75>1,1,F75)),0)","v":0.9}]
[]
[null,"SAFİ KURUM KAZANCI \n(KURUMLAR VERGİSİ MATRAHI)",{"$f":"C59+C63-C64-C65-C69-C70","v":40000000},{"$f":"IF(C78<0, \"ZARAR\",\"KAR\")","v":"KAR"}]
[]
[null,"2022 YILI 3. DÖNEM İNDİRİMLİ KURUMLAR VERGİSİ HESAPLAMA TABLOSU"]
[null,null,"1. TEŞVİK BELGESİ","2. TEŞVİK BELGESİ","3. TEŞVİK BELGESİ","4. TEŞVİK BELGESİ","5. TEŞVİK BELGESİ"]
[null,"Vergi İndirim Oranı (VİO)"]
[null,"KV MATRAHI (Safi Kurum Kazancı)",{"$f":"C78","v":40000000}]
[null,"32/A  Uygulanacak K.V. Matrahı (HER BİR TEŞVİK BELGESİ KAPSAMINDA YARARLANILABİLECEK YATIRIMA KATKI TUTARININ MATRAHI BU HÜCRELERE YAZILMALIDIR)",null,null,null,null,null,{"$f":"IF(SUM(C84:G84)>C78,\"32/A İNDİRİMİ UYGULANACAK KAZANÇ, SAFİ KURUM KAZANCINDAN FAZLADIR\",SUM(C84:G84))","v":0}]
[null,"32/A UYGULANMAYACAK K.V.  Matrahı",{"$f":"IF(C83-(C84+D84+E84+F84+G84)<0,0,C83-(C84+D84+E84+F84+G84))","v":40000000}]
[null,"MATRAH TOPLAMI",{"$f":"IF((C84+D84+E84+F84+G84+C85)>C78,C78,(C84+D84+E84+F84+G84+C85))","v":40000000}]
[]
[null,"SAFİ KURUM KAZANCININ  KV VERGİ ORANLARI İTİBARİYLE DAĞILIMI ","TOPLAM SAFİ KAZANÇ","İhracat Kazancı Payı","Üretim Kazancı Payı","Diğer Faaliyet Kazancı Payı"]
[]
[null,null,{"$f":"C78","v":40000000},{"$f":"IF(AND(AND($D$59>0,($D$59+$E$59)>=$C$59,D59>=C66),$C$90>=MAX(D59,D73)),\n\nMIN(MAX(IF(D59<=C90,D59,IF(D73<=C90,D73)),$C$90*D74)),\n\nIF(OR(D59<=0,D73<=0),0,\n\nMIN( MAX(   MAX(   IF(D59<=C90,D59),  IF(D73<=C90,D73) ),    MIN($C$90*D74,D59,D73)),$C$90)))","v":5000000},{"$f":"MIN( IF(AND(AND($E$59>0,($D$59+$E$59)>=$C$59,E59>=C67),$C$90>=MAX(E59,E73)),\n\nMIN(MAX(IF(E59<=C90,E59,IF(E73<=C90,E73)),$C$90*E74)),\n\nIF(OR(E59<=0,E73<=0),0,\n\nMIN( MAX(   MAX(   IF(E59<=C90,E59),  IF(E73<=C90,E73) ),    MIN($C$90*E74,E59,E73)),$C$90))),C90-D90)","v":0},{"$f":"C90-D90-E90","v":35000000}]
[null,"SAFİ KURUM KAZANCININ DAĞILIMI ORANSAL DAĞILIMI",{"$f":"C90","v":40000000},{"$f":"D90/C90","v":0.125},{"$f":"E90/C90","v":0},{"$f":"F90/C90","v":0.875}]
[null,"SAFİ KURUM KAZANCININ DAĞILIMI TUTARSAL",{"$f":"C91","v":40000000},{"$f":"D90","v":5000000},{"$f":"E90","v":0},{"$f":"F90","v":35000000}]
[null,"SAFİ KURUM KAZANCI DAĞILIMI",{"$f":"C92","v":40000000},{"$f":"IFERROR(IF(D92/C92>=1,1,D92/C92),0)","v":0.125},{"$f":"IFERROR(IF(E92/C92>=1,1,E92/C92),0)","v":0},{"$f":"IFERROR(IF(F92/C92>=1,1,F92/C92),0)","v":0.875},null,"KV ORANI"]
[null,"1 PUAN VE 32/A İNDİRİMİ OLMASAYDI HESAPLANAN KV TUTARI",{"$f":"C93*$H$94","v":10000000},{"$f":"D92*$H$94","v":1250000},{"$f":"E92*$H$94","v":0},{"$f":"F92*$H$94","v":8750000},null,0.25]
[null,"32/ A UYGULANAN MATRAH",{"$f":"C84+D84+E84+F84+G84","v":0},{"$f":"D107+D112+D117+D122+D127","v":0},{"$f":"D106+D111+D116+D121+D126","v":0},{"$f":"D105+D110+D115+D120+D125","v":0}]
[null,"32/A UYGULANACAK MATRAH ÜZERİNDEN ÖDENECEK KV TUTARI",{"$f":"J108+J113+J118+J123+J128","v":0},{"$f":"J107+J112+J117+J122+J127","v":0},{"$f":"J106+J111+J116+J121+J126","v":0},{"$f":"J105+J110+J115+J120+J125","v":0}]
[null,"32/A UYGULANMAYAN MATRAH",{"$f":"IF(C85<=0,0,C85)","v":40000000},{"$f":"D132","v":5000000},{"$f":"D131","v":0},{"$f":"D130","v":35000000}]
[null,"32/A UYGULANMAYAN MATRAH ÜZERİNDEN ÖDENECEK KV TUTARI",{"$f":"L130","v":9750000},{"$f":"J132","v":1000000},{"$f":"J131","v":0},{"$f":"J130","v":8750000}]
[null,"TOPLAM ÖDENECEK KV",{"$f":"C96+C98","v":9750000},{"$f":"J132+J107","v":1000000},{"$f":"J131+J106","v":0},{"$f":"J130+J105","v":8750000}]
[null,"TOPLAM AVANTAJ  (YARARLANILAN 1 PUAN İNDİRİMİ + 32/A İNDİRİMİ TUTARI )",{"$f":"C94-C99","v":250000},{"$f":"D101+D102","v":250000},{"$f":"E101+E102","v":0},{"$f":"F101+F102","v":0}]
[null,"YARARLANILAN 1 - 5 PUAN İNDİRİMİ TUTARI",{"$f":"F133+F128+F123+F118+F113+F108","v":250000},{"$f":"F132+F107+F112+F117+F122+F127","v":250000},{"$f":"F131+F106+F111+F116+F121+F126","v":0},{"$f":"F130+F105+F110+F115+F120+F125","v":0}]
[null,"YARLANILAN 32/A İNDİRİMİ TUTARI",{"$f":"K108+K113+K118+K123+K128+K133","v":0},{"$f":"K107+K112+K122+K127+K132","v":0},{"$f":"K106+K111+K116+K121+K126+K131","v":0},{"$f":"K105++K110+K115+K120+K125+K130","v":0}]
[]
[null,"32/A UYGULANABİLECEK MATRAH (1.TEŞVİK BELGESİ)",{"$f":"C84","v":0},"KV MATRAHI","1 - 5 PUAN İNDİRİM OLMASAYDI HESAPLANAN KV TUTARI","1 -5 Puan İndirim Tutarı","1 - 5 Puan İndirim Sonrasında Hesaplanan KV Tutarı","32/A İndirimi Olmasaydı Ödenecek KV Tutarı","1 -5 Puan İndirim ve 32/A VİO Uygulandıktan Sonra Tatbik Edilecek KV Oranı","1 -5 Puan İndirim ve 32/A İndirimi Uygulandıktan Sonra Ödenecek  KV Tutarı","Yararlanılan Yatırıma Katkı Tutarı\n(32/A İnd. KV Nedeniyle Vazgeçilen Vergi Tutarı)","Ödenecek KV Tutarı"]
[null,"GENEL ORANA TABİ KISIM (DİĞER FAALİYETLER)",{"$f":"F93","v":0.875},{"$f":"C104*C105","v":0},{"$f":"D105*$H$94","v":0},0,{"$f":"E105-F105","v":0},{"$f":"G105","v":0},{"$f":"($H$94)-(($H$94)*$C$82)","v":0.25},{"$f":"I105*D105","v":0},{"$f":"G105-J105","v":0},{"$f":"J108","v":0}]
[null,"1 PUAN İNDİRİMLİ ORANA TABİ KISIM  (İMALAT)",{"$f":"E93","v":0},{"$f":"C104*C106","v":0},{"$f":"D106*$H$94","v":0},{"$f":"D106/100","v":0},{"$f":"E106-F106","v":0},{"$f":"G106","v":0},{"$f":"($H$94-0.01)-(($H$94-0.01)*$C$82)","v":0.24},{"$f":"I106*D106","v":0},{"$f":"G106-J106","v":0}]
[null,"5 PUAN İNDİRİMLİ ORANA TABİ KISIM  ( İHRACAT)",{"$f":"D93","v":0.125},{"$f":"C104*C107","v":0},{"$f":"D107*$H$94","v":0},{"$f":"D107/20","v":0},{"$f":"E107-F107","v":0},0,{"$f":"($H$94-0.05)-(($H$94-0.05)*C82)","v":0.2},0,{"$f":"G107-J107","v":0}]
[null,"TOPLAM",{"$f":"SUM(C105:C107)","v":1},{"$f":"SUM(D105:D107)","v":0},0,{"$f":"SUM(F105:F107)","v":0},{"$f":"SUM(G105:G107)","v":0},{"$f":"SUM(H105:H107)","v":0},null,0,0]
[null,"32/A UYGULANABİLECEK MATRAH (2.TEŞVİK BELGESİ)",{"$f":"D84","v":0},"KV MATRAHI","1 - 5 PUAN İNDİRİM OLMASAYDI HESAPLANAN KV TUTARI","1 -5 Puan İndirim Tutarı","1 -5 Puan İndirim Sonrasında Hesaplanan KV Tutarı","32/A İndirimi Olmasaydı Ödenecek KV Tutarı","1 - 5 Puan İndirim ve 32/A VİO Uygulandıktan Sonra Tatbik Edilecek KV Oranı","1-5  Puan İndirim ve 32/A İndirimi Uygulandıktan Sonra Ödenecek  KV Tutarı","Yararlanılan Yatırıma Katkı Tutarı\n(32/A İnd. KV Nedeniyle Vazgeçilen Vergi Tutarı)","Ödenecek KV Tutarı"]
[null,"GENEL ORANA TABİ KISIM (DİĞER FAALİYETLER)",{"$f":"F93","v":0.875},{"$f":"C109*C110","v":0},{"$f":"D110*$H$94","v":0},0,{"$f":"E110-F110","v":0},{"$f":"G110","v":0},{"$f":"($H$94)-(($H$94)*D82)","v":0.25},{"$f":"I110*D110","v":0},{"$f":"G110-J110","v":0},{"$f":"J113","v":0}]
[null,"1 PUAN İNDİRİMLİ ORANA TABİ KISIM  (İMALAT)",{"$f":"E93","v":0},{"$f":"C109*C111","v":0},{"$f":"D111*$H$94","v":0},{"$f":"D111/100","v":0},{"$f":"E111-F111","v":0},{"$f":"G111","v":0},{"$f":"($H$94-0.01)-(($H$94-0.01)*D82)","v":0.24},{"$f":"I111*D111","v":0},{"$f":"G111-J111","v":0}]
[null,"5 PUAN İNDİRİMLİ ORANA TABİ KISIM  ( İHRACAT)",{"$f":"D93","v":0.125},{"$f":"C109*C112","v":0},{"$f":"D112*$H$94","v":0},{"$f":"D112/20","v":0},{"$f":"E112-F112","v":0},0,{"$f":"($H$94-0.05)-(($H$94-0.05)*D82)","v":0.2},0,{"$f":"G112-J112","v":0}]
[null,"TOPLAM",{"$f":"SUM(C110:C112)","v":1},0,0,{"$f":"SUM(F110:F112)","v":0},{"$f":"SUM(G110:G112)","v":0},{"$f":"SUM(H110:H112)","v":0},null,{"$f":"SUM(J110:J112)","v":0},0]
[null,"32/A UYGULANABİLECEK MATRAH (3.TEŞVİK BELGESİ)",{"$f":"E84","v":0},"KV MATRAHI","1 - 5 PUAN İNDİRİM OLMASAYDI HESAPLANAN KV TUTARI","1-5 Puan İndirim Tutarı","1 - 5 Puan İndirim Sonrasında Hesaplanan KV Tutarı","32/A İndirimi Olmasaydı Ödenecek KV Tutarı","1 - 5 Puan İndirim ve 32/A VİO Uygulandıktan Sonra Tatbik Edilecek KV Oranı","1 -5 Puan İndirim ve 32/A İndirimi Uygulandıktan Sonra Ödenecek  KV Tutarı","Yararlanılan Yatırıma Katkı Tutarı\n(32/A İnd. KV Nedeniyle Vazgeçilen Vergi Tutarı)","Ödenecek KV Tutarı"]
[null,"GENEL ORANA TABİ KISIM (DİĞER FAALİYETLER)",{"$f":"F93","v":0.875},{"$f":"C114*C115","v":0},{"$f":"D115*$H$94","v":0},0,{"$f":"E115-F115","v":0},{"$f":"G115","v":0},{"$f":"($H$94)-(($H$94)*E82)","v":0.25},{"$f":"I115*D115","v":0},{"$f":"G115-J115","v":0},{"$f":"J118","v":0}]
[null,"1 PUAN İNDİRİMLİ ORANA TABİ KISIM  (İMALAT)",{"$f":"E93","v":0},{"$f":"C114*C116","v":0},{"$f":"D116*$H$94","v":0},{"$f":"D116/100","v":0},{"$f":"E116-F116","v":0},{"$f":"G116","v":0},{"$f":"($H$94-0.01)-(($H$94-0.01)*E82)","v":0.24},{"$f":"I116*D116","v":0},{"$f":"G116-J116","v":0}]
[null,"5 PUAN İNDİRİMLİ ORANA TABİ KISIM  ( İHRACAT)",{"$f":"D93","v":0.125},{"$f":"C114*C117","v":0},{"$f":"D117*$H$94","v":0},{"$f":"D117/20","v":0},{"$f":"E117-F117","v":0},0,{"$f":"($H$94-0.05)-(($H$94-0.05)*E82)","v":0.2},0,{"$f":"G117-J117","v":0}]
[null,"TOPLAM",{"$f":"SUM(C115:C117)","v":1},0,0,{"$f":"SUM(F115:F117)","v":0},{"$f":"SUM(G115:G117)","v":0},{"$f":"SUM(H115:H117)","v":0},null,{"$f":"SUM(J115:J117)","v":0},0]
[null,"32/A UYGULANABİLECEK MATRAH (4. TEŞVİK BELGESİ)",{"$f":"F84","v":0},"KV MATRAHI","1 - 5 PUAN İNDİRİM OLMASAYDI HESAPLANAN KV TUTARI","1-5 Puan İndirim Tutarı","1 -5 Puan İndirim Sonrasında Hesaplanan KV Tutarı","32/A İndirimi Olmasaydı Ödenecek KV Tutarı","1- 5  Puan İndirim ve 32/A VİO Uygulandıktan Sonra Tatbik Edilecek KV Oranı","1-5 Puan İndirim ve 32/A İndirimi Uygulandıktan Sonra Ödenecek  KV Tutarı","Yararlanılan Yatırıma Katkı Tutarı\n(32/A İnd. KV Nedeniyle Vazgeçilen Vergi Tutarı)","Ödenecek KV Tutarı"]
[null,"GENEL ORANA TABİ KISIM (DİĞER FAALİYETLER)",{"$f":"F93","v":0.875},{"$f":"C119*C120","v":0},{"$f":"D120*$H$94","v":0},0,{"$f":"E120-F120","v":0},{"$f":"G120","v":0},{"$f":"($H$94)-(($H$94)*F82)","v":0.25},{"$f":"I120*D120","v":0},{"$f":"G120-J120","v":0},{"$f":"J123","v":0}]
[null,"1 PUAN İNDİRİMLİ ORANA TABİ KISIM  (İMALAT)",{"$f":"E93","v":0},{"$f":"C119*C121","v":0},{"$f":"D121*$H$94","v":0},{"$f":"D121/100","v":0},{"$f":"E121-F121","v":0},{"$f":"G121","v":0},{"$f":"($H$94-0.01)-(($H$94-0.01)*F82)","v":0.24},{"$f":"I121*D121","v":0},{"$f":"G121-J121","v":0}]
[null,"5 PUAN İNDİRİMLİ ORANA TABİ KISIM  ( İHRACAT)",{"$f":"D93","v":0.125},{"$f":"C119*C122","v":0},{"$f":"D122*$H$94","v":0},{"$f":"D122/20","v":0},{"$f":"E122-F122","v":0},0,{"$f":"($H$94-0.05)-(($H$94-0.05)*F82)","v":0.2},0,{"$f":"G122-J122","v":0}]
[null,"TOPLAM",{"$f":"SUM(C120:C122)","v":1},0,0,{"$f":"SUM(F120:F122)","v":0},{"$f":"SUM(G120:G122)","v":0},{"$f":"SUM(H120:H122)","v":0},null,{"$f":"SUM(J120:J122)","v":0},0]
[null,"32/A UYGULANABİLECEK MATRAH (5.TEŞVİK BELGESİ)",{"$f":"G84","v":0},"KV MATRAHI","1 - 5 PUAN İNDİRİM OLMASAYDI HESAPLANAN KV TUTARI","1-5 Puan İndirim Tutarı","1 - 5 Puan İndirim Sonrasında Hesaplanan KV Tutarı","32/A İndirimi Olmasaydı Ödenecek KV Tutarı","1 -5 Puan İndirim ve 32/A VİO Uygulandıktan Sonra Tatbik Edilecek KV Oranı","1 - 5 Puan İndirim ve 32/A İndirimi Uygulandıktan Sonra Ödenecek  KV Tutarı","Yararlanılan Yatırıma Katkı Tutarı\n(32/A İnd. KV Nedeniyle Vazgeçilen Vergi Tutarı)","Ödenecek KV Tutarı"]
[null,"GENEL ORANA TABİ KISIM (DİĞER FAALİYETLER)",{"$f":"F93","v":0.875},{"$f":"C124*C125","v":0},{"$f":"D125*$H$94","v":0},0,{"$f":"E125-F125","v":0},{"$f":"G125","v":0},{"$f":"($H$94)-(($H$94)*G82)","v":0.25},{"$f":"I125*D125","v":0},{"$f":"G125-J125","v":0},{"$f":"J128","v":0}]
[null,"1 PUAN İNDİRİMLİ ORANA TABİ KISIM  (İMALAT)",{"$f":"E93","v":0},{"$f":"C124*C126","v":0},{"$f":"D126*$H$94","v":0},{"$f":"D126/100","v":0},{"$f":"E126-F126","v":0},{"$f":"G126","v":0},{"$f":"($H$94-0.01)-(($H$94-0.01)*G82)","v":0.24},{"$f":"I126*D126","v":0},{"$f":"G126-J126","v":0}]
[null,"5 PUAN İNDİRİMLİ ORANA TABİ KISIM  ( İHRACAT)",{"$f":"D93","v":0.125},{"$f":"C124*C127","v":0},{"$f":"D127*$H$94","v":0},{"$f":"D127/20","v":0},{"$f":"E127-F127","v":0},0,{"$f":"($H$94-0.05)-(($H$94-0.05)*G82)","v":0.2},0,{"$f":"G127-J127","v":0}]
[null,"TOPLAM",{"$f":"SUM(C125:C127)","v":1},0,0,{"$f":"SUM(F125:F127)","v":0},{"$f":"SUM(G125:G127)","v":0},{"$f":"SUM(H125:H127)","v":0},null,{"$f":"SUM(J125:J127)","v":0},0]
[null,"32/A UYGULANAMAYACAK MATRAH",{"$f":"IF(C85<=0,0,C85)","v":40000000},"KV MATRAHI","1-5 PUAN İNDİRİM OLMASAYDI HESAPLANAN KV TUTARI","1-5 Puan İndirim Tutarı","1 -5 Puan İndirim Sonrasında Hesaplanan KV Tutarı","32/A İNDİRİMİ UYGULANMAZ",null,"1 Puan İndirim ve 32/A İndirimi Uygulandıktan Sonra Ödenecek  KV Tutarı","Yararlanılan Yatırıma Katkı Tutarı\n(32/A İnd. KV Nedeniyle Vazgeçilen Vergi Tutarı)","Ödenecek KV Tutarı"]
[null,"GENEL ORANA TABİ KISIM (DİĞER FAALİYETLER)",{"$f":"F93","v":0.875},{"$f":"C129*C130","v":35000000},{"$f":"D130*$H$94","v":8750000},0,{"$f":"E130-F130","v":8750000},null,null,{"$f":"G130","v":8750000},{"$f":"G130-J130","v":0},{"$f":"J133","v":9750000}]
[null,"1 PUAN İNDİRİMLİ ORANA TABİ KISIM  (İMALAT)",{"$f":"E93","v":0},{"$f":"C131*C129","v":0},{"$f":"D131*$H$94","v":0},{"$f":"D131/100","v":0},{"$f":"E131-F131","v":0},null,null,{"$f":"G131","v":0},{"$f":"G131-J131","v":0}]
[null,"5 PUAN İNDİRİMLİ ORANA TABİ KISIM  ( İHRACAT)",{"$f":"D93","v":0.125},{"$f":"C132*C129","v":5000000},{"$f":"D132*$H$94","v":1250000},{"$f":"D132/20","v":250000},{"$f":"E132-F132","v":1000000},null,null,1000000,0]
[null,"TOPLAM",{"$f":"SUM(C130:C132)","v":1},{"$f":"SUM(D130:D132)","v":40000000},10000000,{"$f":"SUM(F130:F132)","v":250000},{"$f":"SUM(G130:G132)","v":9750000},null,null,9750000,0]
[null,"TOPLAM KV MATRAHI VE ÖDENMESİ GEREKEN KV ",{"$f":"C104+C129+C109+C114+C119+C124","v":40000000},{"$f":"D108+D133+D113+D118+D123+D128","v":40000000},{"$f":"E108+E133+E113+E118+E123+E128","v":10000000},{"$f":"F108+F133+F113+F118+F123+F128","v":250000},{"$f":"G108+G133+G113+G118+G123+G128","v":9750000},null,null,{"$f":"J108+J133+J113+J118+J123+J128","v":9750000},{"$f":"K133+K108+K113+K118+K123+K128","v":0},{"$f":"L105+L130+L110+L115+L120+L125","v":9750000}]
[]
[null,"GEÇİCİ VERGİ BEYANNMESİNDE MATRAH BİLDİRİMİ BÖLÜMÜNDE DOLDURULACAK KISIMLAR VE TUTARLARI"]
[null,"32 A Madde Kapsamında İndirimli Kurumlar Vergisine (Geçici Vergiye) Tabi Matrah",{"$f":"C104+C109+C114+C119+C124","v":0},{"$f":"E108+E113+E118+E123+E128","v":0},"1-5 Puan Olmasaydı Hesaplan KV Tutarı"]
[null,null,null,{"$f":"G108+G113+G118+G123++G128","v":0},"1 -5 Puan İndirim Sonrasında Ödenecek KV Tutarı\n (32 A olmasaydı hesaplanacak Vergi)"]
[null,null,null,{"$f":"K108+K113+K118+K123+K128","v":0},"32/A İndirimi ile Vazgeçilen Vergi"]
[null,"32 A Madde Kapsamında İndirimli Kurumlar Vergisi(Geçici Vergi) Oranı",{"$f":"IFERROR(D140/C137,0)","v":0},{"$f":"L105+L110+L115+L120+L125","v":0},"32/A ya Tabi Matrah Üzerinden Ödenecek KV"]
[null,"32/7 Madde Kapsamında İndirimli Kurumlar Vergisine (Geçici Vergiye) Tabi Matrah  (İhracat)",{"$f":"D132","v":5000000},{"$f":"E132","v":1250000},"5 Puan Olmasaydı Hesaplan KV Tutarı"]
[null,null,null,{"$f":"F132","v":250000},"5 Puan İndirimin Vergi Etkisi "]
[null,"32/7 Madde Kapsamında İndirimli Kurumlar Vergisi (Geçici Vergi) Oranı",{"$f":"IFERROR(D143/C141,0)","v":0.2},{"$f":"G132","v":1000000},"5 Puan İndirim Sonrasında Ödenecek KV Tutarı (İhracat)\n"]
[null,"32/8 Madde Kapsamında İndirimli Kurumlar Vergisine (Geçici Vergiye) Tabi Matrah  (Üretim)",{"$f":"D131","v":0},{"$f":"E131","v":0},"1 Puan Olmasaydı Hesaplan KV Tutarı"]
[null,null,null,{"$f":"F131","v":0},"1 Puan İndirimin Vergi Etkisi "]
[null,"32/8 Madde Kapsamında İndirimli Kurumlar Vergisi (Geçici Vergi) Oranı",{"$f":"IFERROR(D146/C144,0)","v":0},{"$f":"G131","v":0},"1 Puan İndirim Sonrasında Ödenecek KV Tutarı (Üretim)\n"]
[null,"Genel Orana Tabi Matrah (Diğer)",{"$f":"D130","v":35000000},{"$f":"J130","v":8750000},"Diğer Faalilyetlerden Elde Edilen Kazanç"]
[null,null,{"$f":"IFERROR(D147/C147,0)","v":0.25}]
[null,"MATRAHLAR TOPLAMI",{"$f":"C137+C144+C141+C147","v":40000000},{"$f":"D140+D146+D143+D147","v":9750000}]

{"sheet":"Ü Ö1","index":7,"n_rows":149,"n_cols":12,"rows_kept":149,"cut":false,"hidden":true,"merged":[[84,2,84,6],[1,1,2,1],[59,1,59,2],[60,1,60,2],[71,1,72,1],[73,1,73,2],[74,1,74,2],[74,3,74,4],[75,1,75,2],[75,3,75,4],[79,1,79,3],[82,2,82,6],[85,2,85,6],[87,1,89,1],[87,2,88,2],[87,3,88,3],[87,4,88,4],[87,5,88,5],[135,1,135,4],[137,1,138,2],[104,11,107,11],[109,11,112,11],[114,11,117,11],[119,11,122,11],[124,11,127,11],[128,7,133,8],[129,11,132,11]]}
[]
[null,"FAALİYET TÜRLERİ İTİBARİYLE HASILATLAR VE TOPLAM İÇİNDEKİ ORANLARI",{"$f":"IFERROR(C4/C4,0)","v":1},{"$f":"IFERROR(D4/C4,0)","v":0},{"$f":"IFERROR(E4/C4,0)","v":0.7},{"$f":"IFERROR(F4/C4,0)","v":0.3}]
[null,null,"Toplam Hasılat","İhracat faaliyeti","İmalat faaliyeti","Diğer faaliyetler"]
[null,"A-BRÜT SATIŞLAR (60)",{"$f":"D4+E4+F4","v":2000000},{"$f":"SUM(D5:D7)","v":0},{"$f":"SUM(E5:E7)","v":1400000},600000]
[null,"1-Yurtiçi Satışlar (600)",{"$f":"D5+E5+F5","v":2000000},null,1400000,600000]
[null,"2-Yurtdışı Satışlar (601)",{"$f":"D6+E6+F6","v":0},0]
[null,"3-Diğer Gelirler (602)",{"$f":"D7+E7+F7","v":0}]
[null,"B-SATIŞ İNDİRİMLERİ(-) (61)",{"$f":"SUM(C9:C11)","v":0},{"$f":"SUM(D9:D11)","v":0},{"$f":"SUM(E9:E11)","v":0},0]
[null,"1-Satıştan İadeler (-) (610)",{"$f":"SUM(D9:F9)","v":0}]
[null,"2- Satış İskontoları (-) (611)",{"$f":"SUM(D10:F10)","v":0}]
[null,"3-Diğer İndirimler (-) (612)",0]
[null,"C-NET SATIŞLAR",{"$f":"C4-C8","v":2000000},{"$f":"D4-D8","v":0},{"$f":"E4-E8","v":1400000},600000]
[null,"D-SATIŞLARIN MALİYETİ (-) (62)",{"$f":"SUM(C14:C17)","v":0},{"$f":"SUM(D14:D17)","v":0},{"$f":"SUM(E14:E17)","v":0},{"$f":"SUM(F14:F17)","v":0}]
[null,"1-Satılan Mamuller Maliyeti ( 620)",{"$f":"SUM(D14:F14)","v":0}]
[null,"2-Satılan Ticari Mal Maliyeti (621)",{"$f":"SUM(D15:F15)","v":0}]
[null,"3-Satılan Hizmet Maliyeti (622)",0]
[null,"4-Diğer Satışların Maliyeti (623)",0]
[null,"BRÜT SATIŞ KARI / ZARARI",{"$f":"C12-C13","v":2000000},{"$f":"D12-D13","v":0},{"$f":"E12-E13","v":1400000},600000]
[null,"E-FAALİYET GİDERLERİ (-) (63)",{"$f":"SUM(C20:C24)","v":0},{"$f":"SUM(D20:D24)","v":0},{"$f":"SUM(E20:E24)","v":0},0]
[null,"1-Araştırma ve Geliştirme Giderleri(-) (630)",{"$f":"SUM(D20:F20)","v":0}]
[null,"2-Pazarlama, Satış ve Dağıtım Giderleri(-) (631)",{"$f":"SUM(D21:F21)","v":0}]
[null,"3-Genel Yönetim Giderleri(-) (632)",{"$f":"SUM(D22:F22)","v":0}]
[null,"MÜŞTEREK GENEL GİDERLER (DAĞITIM-HASILAT PAYINA GÖRE)",null,{"$f":"C23*D2","v":0},{"$f":"C23*E2","v":0},{"$f":"C23*F2","v":0}]
[null,"MÜŞTEREK GENEL GİDER GİBİ DAĞITIMA TABİ TUTULACAK AMORTİSMAN GİDERLERİ  (DAĞITIM-HASILAT PAYINA GÖRE)",null,{"$f":"C24*D2","v":0},{"$f":"C24*E2","v":0},{"$f":"C24*F2","v":0}]
[null,"FAALİYET KARI / ZARARI ",{"$f":"C18-C19","v":2000000},{"$f":"D18-D19","v":0},{"$f":"E18-E19","v":1400000},600000]
[null,"F-DİĞER FAALİYETLERDEN OLAĞAN GELİR VE KARLAR (64)",{"$f":"SUM(C27:C35)","v":0},{"$f":"SUM(D27:D35)","v":0},{"$f":"SUM(E27:E35)","v":0},{"$f":"SUM(F27:F35)","v":0}]
[null,"         1- İŞTİRAKLERDEN TEMETTÜ GELİRLERİ (640)",{"$f":"SUM(D27:F27)","v":0}]
[null,"         2- BAĞLI ORTAKLIKLARDAN TEMETTÜ GELİRLERİ (641)",{"$f":"SUM(D28:F28)","v":0}]
[null,"         3- FAİZ GELİRLERİ (642) (ihracat ve imalat kaynaklı alacağın tahsiline kadar olan süreçte oluşan)",0]
[null,"         4- KOMİSYON GELİRLERİ (643)",0]
[null,"         5- KONUSU OLMAYAN KARŞILIKLAR (644)",0]
[null,"         6- MENKUL KIYMET SATIŞ KARLARI (645)",0]
[null,"         7- KAMBİYO KARLARI (646) (ihracat ve imalat kaynaklı alacağın tahsiline kadar olan süreçte oluşan)",0]
[null,"         8- REESKONT FAİZ GELİRLERİ (647)",0]
[null,"         9- FAALİYETLE İLGİLİ DİĞER GELİR VE KARLAR (649)",0]
[null,"ARA TOPLAM",{"$f":"C25+C26","v":2000000},{"$f":"D25+D26","v":0},{"$f":"E25+E26","v":1400000},{"$f":"F25+F26","v":600000}]
[null,"G-DİĞER FAALİYETLERDEN OLAĞAN GİDER VE ZARARLAR(-) (65)",{"$f":"SUM(C38:C43)","v":0},{"$f":"SUM(D38:D43)","v":0},{"$f":"SUM(E38:E43)","v":0},0]
[null,"         1- KOMİSYON GİDERLERİ (653)",{"$f":"SUM(D38:F38)","v":0}]
[null,"         2- KARŞILIK GİDERLERİ (654)",{"$f":"SUM(D39:F39)","v":0}]
[null,"         3- MENKUL KIYMET SATIŞ ZARARLARI (655)",0]
[null,"         4- KAMBİYO ZARARLARI (656) (ihracat ve imalat kaynaklı alacağın tahsiline kadar olan süreçte oluşan)",0]
[null,"         5- REESKONT FAİZ GİDERLERİ (657)",0]
[null,"         6- DİĞER OLAĞAN GİDER VE ZARARLAR (659)",{"$f":"SUM(D43:F43)","v":0}]
[null,"ARA TOPLAM",{"$f":"C36-C37","v":2000000},{"$f":"D36-D37","v":0},{"$f":"E36-E37","v":1400000},600000]
[null,"H-FİNANSMAN GİDERLERİ(-) (66)",{"$f":"SUM(C46:C49)","v":0},{"$f":"SUM(D46:D49)","v":0},{"$f":"SUM(E46:E49)","v":0},{"$f":"SUM(F46:F49)","v":0}]
[null,"         1- KISA VADELİ BORÇLANMA GİDERLERİ (-)",{"$f":"SUM(D46:F46)","v":0}]
[null,"         2- UZUN VADELİ BORÇLANMA GİDERLERİ (-)",{"$f":"SUM(D47:F47)","v":0}]
[null,"         1- KISA VADELİ BORÇLANMA GİDERLERİ (-) (DAĞITIM)",null,{"$f":"C48*D2","v":0},{"$f":"C48*E2","v":0},{"$f":"C48*F2","v":0}]
[null,"         2- UZUN VADELİ BORÇLANMA GİDERLERİ (-) (DAĞITIM)",null,{"$f":"C49*D2","v":0},{"$f":"C49*E2","v":0},{"$f":"C49*F2","v":0}]
[null,"ARA TOPLAM",{"$f":"C44-C45","v":2000000},{"$f":"D44-D45","v":0},{"$f":"E44-E45","v":1400000},{"$f":"F44-F45","v":600000}]
[null,"I-OLAĞANDIŞI GELİR VE KÂRLAR (67)",{"$f":"SUM(D51:F51)","v":0},{"$f":"SUM(D52:D53)","v":0},{"$f":"SUM(E52:E53)","v":0},{"$f":"SUM(F52:F53)","v":0}]
[null,"1- ÖNCEKİ DÖNEM GELİR VE KARLARI (671)",{"$f":"SUM(D52:F52)","v":0}]
[null,"2-DİĞER OLAĞAN DIŞI GELİR VE KARLAR (679)",{"$f":"SUM(D53:F53)","v":0}]
[null,"ARA TOPLAM",{"$f":"SUM(D54:F54)","v":2000000},{"$f":"D50+D51","v":0},{"$f":"E50+E51","v":1400000},600000]
[null,"J-OLAĞANDIŞI GİDER VE ZARARLAR(-) (68)",{"$f":"SUM(C56:C58)","v":0},{"$f":"SUM(D56:D58)","v":0},{"$f":"SUM(E56:E58)","v":0},0]
[null,"1-Çalışmayan Kısım Gider ve Zararları(-) (680)",{"$f":"SUM(D56:F56)","v":0}]
[null,"2-Önceki Dönem Gider ve Zararları(-) (681)",{"$f":"SUM(D57:F57)","v":0}]
[null,"3-Diğer Olağan Dışı Gider ve Zararlar(-) (689)",0]
[null,"DÖNEM KÂRI VEYA ZARARI \n(TİCARİ BİLANÇO KARI ZARARI )",{"$f":"C54-C55","v":2000000},{"$f":"D54-D55","v":0},{"$f":"E54-E55","v":1400000},600000]
[null,"İHRACAT, İMALAT VE DİĞER FAALİYETLERDEN ELDE EDİLEN KAZANCIN TOPLAM TİCARİ KAZANÇ İÇİNDEKİ PAYLARI  \n\n(Kazançlar arasında Öncelik İhracat Kazancına Verilmiştir. İhrcat Kazancından arta kalan Ticari Kazanç İmalat ve Diğer Faaliyetlere Sayılmıştır.)\n\n",null,{"$f":"IF(D59>=$C$59,1,\n    IF(D59<=0,0,\n    IF(AND(D59>0,D59<$C$59),D59/$C$59)))","v":0},{"$f":"IF(E59>=$C$59,1,\n    IF(E59<=0,0,\n    IF(AND(E59>0,E59<$C$59),E59/$C$59)))","v":0.7},{"$f":"IF(F59>=$C$59,1,\n    IF(F59<=0,0,\n    IF(AND(F59>0,F59<$C$59),F59/$C$59)))","v":0.3}]
[null,null,null,{"$f":"D60/(D60+E60+F60)","v":0},{"$f":"E60/(D60+E60+F60)","v":0.7},{"$f":"F60/(D60+E60+F60)","v":0.3}]
[]
[null,"KKEG +",500000]
[null," KABUL EDİLMEYEN GELİRLER -"]
[null,"ZARAR OLSA DAHİ İNDİRİLECEK İSTİSNALAR -",{"$f":"C66+C67+C68","v":0}]
[null,"Hizmet İhracatı Faaliyetinden (KVK 10-1/ğ) Elde Edilen Kazançlardan İstisna Edilenlerin Toplamı"]
[null,"İmalat Faaliyetinden Elde Edilen Kazançlardan İstisna Edilenlerin Toplamı"]
[null,"Diğer Faaliyetlerden Elde Edilen Kazançlardan İstisna Edilenlerin Toplamı"]
[null,"GEÇMİŞ YIL ZARARLARI -",1200000]
[null,"İNDİRİMLER -",null,"AZAMİ YAZILABİLECEK İNDİRİMLER TUTARI",{"$f":"C59+C63-C64-C65-C69","v":1300000}]
[]
[null,"1 PUAN İNDİRİM UYGULANACAK TUTARIN HESABINDA İSTİSNA KAZANÇLAR DÜŞÜLDÜKTEN SONRA BULUNAN TİCARİ KAZANÇ TUTARI İLE  İHRACAT,İMALAT VE DİĞER KAZANÇLARIN TUTARI","TİCARİ KAZANÇ TAN İhracat ve İmalat Kazancından İstisna Olan Tutarlar Düşüldükten Sonra Kalan Tutarı","İhracat Faaliyetinden Elde Edilen  Kazançtan İstisna Olan Kısım Düşüldükten Sonra Bulunan Tutarı","Üretim  Faaliyetinden Elde Edilen  Kazançtan İstisna Olan Kısım Düşüldükten Sonra Bulunan Tutarı","Diğer Faaliyetinden Elde Edilen  Kazanç"]
[null,null,{"$f":"IF(C59-C66-C67<=0,0,C59-C66-C67)","v":2000000},{"$f":"IF($D$59-C66<=0,0,MIN($D$59-C66,$C$73*D61))","v":0},{"$f":"IF($E$59-C67<=0,0,MIN($E$59-C67,$C$73*E61))","v":1400000},{"$f":"IF(C73-D73-E73<=0,0,C73-D73-E73)","v":600000}]
[null,"MATRAH DAĞITIM PAYLARI",null,{"$f":"IFERROR(IF(D73/C73<=0,0,D73/C73),0)","v":0},{"$f":"IFERROR(IF(E73/C73<=0,0,E73/C73),0)","v":0.7},{"$f":"IFERROR(F73/C73,0)","v":0.3}]
[null,"İHRACAT, İMALAT VE DİĞER FAALİYETLERDEN ELDE EDİLEN KAZANCIN TOPLAM TİCARİ KAZANÇ İÇİNDEKİ PAYLARI ",null,{"$f":"IFERROR(IF(AND(D73+E73>C73, F73<=0),1,(D73+E73)/C73),0)","v":0.7},null,{"$f":"IFERROR(IF(F73<=0,0,F73/C73),0)","v":0.3}]
[null,"NEGATİF VE % 100 DEN BÜYÜKLÜK KONTROLÜ SONRASINDAKİ PAYLARI",null,{"$f":"IFERROR(IF(D75<=0,0,IF(D75>1,1,D75)),0)","v":0.7},null,{"$f":"IFERROR(IF(F75<=0,0,IF(F75>1,1,F75)),0)","v":0.3}]
[]
[null,"SAFİ KURUM KAZANCI \n(KURUMLAR VERGİSİ MATRAHI)",{"$f":"C59+C63-C64-C65-C69-C70","v":1300000},{"$f":"IF(C78<0, \"ZARAR\",\"KAR\")","v":"KAR"}]
[]
[null,"2022 YILI 3. DÖNEM İNDİRİMLİ KURUMLAR VERGİSİ HESAPLAMA TABLOSU"]
[null,null,"1. TEŞVİK BELGESİ","2. TEŞVİK BELGESİ","3. TEŞVİK BELGESİ","4. TEŞVİK BELGESİ","5. TEŞVİK BELGESİ"]
[null,"Vergi İndirim Oranı (VİO)"]
[null,"KV MATRAHI (Safi Kurum Kazancı)",{"$f":"C78","v":1300000}]
[null,"32/A  Uygulanacak K.V. Matrahı (HER BİR TEŞVİK BELGESİ KAPSAMINDA YARARLANILABİLECEK YATIRIMA KATKI TUTARININ MATRAHI BU HÜCRELERE YAZILMALIDIR)",null,null,null,null,null,{"$f":"IF(SUM(C84:G84)>C78,\"32/A İNDİRİMİ UYGULANACAK KAZANÇ, SAFİ KURUM KAZANCINDAN FAZLADIR\",SUM(C84:G84))","v":0}]
[null,"32/A UYGULANMAYACAK K.V.  Matrahı",{"$f":"IF(C83-(C84+D84+E84+F84+G84)<0,0,C83-(C84+D84+E84+F84+G84))","v":1300000}]
[null,"MATRAH TOPLAMI",{"$f":"IF((C84+D84+E84+F84+G84+C85)>C78,C78,(C84+D84+E84+F84+G84+C85))","v":1300000}]
[]
[null,"SAFİ KURUM KAZANCININ  KV VERGİ ORANLARI İTİBARİYLE DAĞILIMI ","TOPLAM SAFİ KAZANÇ","İhracat Kazancı Payı","Üretim Kazancı Payı","Diğer Faaliyet Kazancı Payı"]
[]
[null,null,{"$f":"C78","v":1300000},{"$f":"IF(AND(AND($D$59>0,($D$59+$E$59)>=$C$59,D59>=C66),$C$90>=MAX(D59,D73)),\n\nMIN(MAX(IF(D59<=C90,D59,IF(D73<=C90,D73)),$C$90*D74)),\n\nIF(OR(D59<=0,D73<=0),0,\n\nMIN( MAX(   MAX(   IF(D59<=C90,D59),  IF(D73<=C90,D73) ),    MIN($C$90*D74,D59,D73)),$C$90)))","v":0},{"$f":"MIN( IF(AND(AND($E$59>0,($D$59+$E$59)>=$C$59,E59>=C67),$C$90>=MAX(E59,E73)),\n\nMIN(MAX(IF(E59<=C90,E59,IF(E73<=C90,E73)),$C$90*E74)),\n\nIF(OR(E59<=0,E73<=0),0,\n\nMIN( MAX(   MAX(   IF(E59<=C90,E59),  IF(E73<=C90,E73) ),    MIN($C$90*E74,E59,E73)),$C$90))),C90-D90)","v":910000},{"$f":"C90-D90-E90","v":390000}]
[null,"SAFİ KURUM KAZANCININ DAĞILIMI ORANSAL DAĞILIMI",{"$f":"C90","v":1300000},{"$f":"D90/C90","v":0},{"$f":"E90/C90","v":0.7},{"$f":"F90/C90","v":0.3}]
[null,"SAFİ KURUM KAZANCININ DAĞILIMI TUTARSAL",{"$f":"C91","v":1300000},{"$f":"D90","v":0},{"$f":"E90","v":910000},{"$f":"F90","v":390000}]
[null,"SAFİ KURUM KAZANCI DAĞILIMI",{"$f":"C92","v":1300000},{"$f":"IFERROR(IF(D92/C92>=1,1,D92/C92),0)","v":0},{"$f":"IFERROR(IF(E92/C92>=1,1,E92/C92),0)","v":0.7},{"$f":"IFERROR(IF(F92/C92>=1,1,F92/C92),0)","v":0.3},null,"KV ORANI"]
[null,"1 PUAN VE 32/A İNDİRİMİ OLMASAYDI HESAPLANAN KV TUTARI",{"$f":"C93*$H$94","v":325000},{"$f":"D92*$H$94","v":0},{"$f":"E92*$H$94","v":227500},{"$f":"F92*$H$94","v":97500},null,0.25]
[null,"32/ A UYGULANAN MATRAH",{"$f":"C84+D84+E84+F84+G84","v":0},{"$f":"D107+D112+D117+D122+D127","v":0},{"$f":"D106+D111+D116+D121+D126","v":0},{"$f":"D105+D110+D115+D120+D125","v":0}]
[null,"32/A UYGULANACAK MATRAH ÜZERİNDEN ÖDENECEK KV TUTARI",{"$f":"J108+J113+J118+J123+J128","v":0},{"$f":"J107+J112+J117+J122+J127","v":0},{"$f":"J106+J111+J116+J121+J126","v":0},{"$f":"J105+J110+J115+J120+J125","v":0}]
[null,"32/A UYGULANMAYAN MATRAH",{"$f":"IF(C85<=0,0,C85)","v":1300000},{"$f":"D132","v":0},{"$f":"D131","v":910000},{"$f":"D130","v":390000}]
[null,"32/A UYGULANMAYAN MATRAH ÜZERİNDEN ÖDENECEK KV TUTARI",{"$f":"L130","v":315900},{"$f":"J132","v":0},{"$f":"J131","v":218400},{"$f":"J130","v":97500}]
[null,"TOPLAM ÖDENECEK KV",{"$f":"C96+C98","v":315900},{"$f":"J132+J107","v":0},{"$f":"J131+J106","v":218400},{"$f":"J130+J105","v":97500}]
[null,"TOPLAM AVANTAJ  (YARARLANILAN 1 PUAN İNDİRİMİ + 32/A İNDİRİMİ TUTARI )",{"$f":"C94-C99","v":9100},{"$f":"D101+D102","v":0},{"$f":"E101+E102","v":9100},{"$f":"F101+F102","v":0}]
[null,"YARARLANILAN 1 - 5 PUAN İNDİRİMİ TUTARI",{"$f":"F133+F128+F123+F118+F113+F108","v":9100},{"$f":"F132+F107+F112+F117+F122+F127","v":0},{"$f":"F131+F106+F111+F116+F121+F126","v":9100},{"$f":"F130+F105+F110+F115+F120+F125","v":0}]
[null,"YARLANILAN 32/A İNDİRİMİ TUTARI",{"$f":"K108+K113+K118+K123+K128+K133","v":0},{"$f":"K107+K112+K122+K127+K132","v":0},{"$f":"K106+K111+K116+K121+K126+K131","v":0},{"$f":"K105++K110+K115+K120+K125+K130","v":0}]
[]
[null,"32/A UYGULANABİLECEK MATRAH (1.TEŞVİK BELGESİ)",{"$f":"C84","v":0},"KV MATRAHI","1 - 5 PUAN İNDİRİM OLMASAYDI HESAPLANAN KV TUTARI","1 -5 Puan İndirim Tutarı","1 - 5 Puan İndirim Sonrasında Hesaplanan KV Tutarı","32/A İndirimi Olmasaydı Ödenecek KV Tutarı","1 -5 Puan İndirim ve 32/A VİO Uygulandıktan Sonra Tatbik Edilecek KV Oranı","1 -5 Puan İndirim ve 32/A İndirimi Uygulandıktan Sonra Ödenecek  KV Tutarı","Yararlanılan Yatırıma Katkı Tutarı\n(32/A İnd. KV Nedeniyle Vazgeçilen Vergi Tutarı)","Ödenecek KV Tutarı"]
[null,"GENEL ORANA TABİ KISIM (DİĞER FAALİYETLER)",{"$f":"F93","v":0.3},{"$f":"C104*C105","v":0},{"$f":"D105*$H$94","v":0},0,{"$f":"E105-F105","v":0},{"$f":"G105","v":0},{"$f":"($H$94)-(($H$94)*$C$82)","v":0.25},{"$f":"I105*D105","v":0},{"$f":"G105-J105","v":0},{"$f":"J108","v":0}]
[null,"1 PUAN İNDİRİMLİ ORANA TABİ KISIM  (İMALAT)",{"$f":"E93","v":0.7},{"$f":"C104*C106","v":0},{"$f":"D106*$H$94","v":0},{"$f":"D106/100","v":0},{"$f":"E106-F106","v":0},{"$f":"G106","v":0},{"$f":"($H$94-0.01)-(($H$94-0.01)*$C$82)","v":0.24},{"$f":"I106*D106","v":0},{"$f":"G106-J106","v":0}]
[null,"5 PUAN İNDİRİMLİ ORANA TABİ KISIM  ( İHRACAT)",{"$f":"D93","v":0},{"$f":"C104*C107","v":0},{"$f":"D107*$H$94","v":0},{"$f":"D107/20","v":0},{"$f":"E107-F107","v":0},0,{"$f":"($H$94-0.05)-(($H$94-0.05)*C82)","v":0.2},0,{"$f":"G107-J107","v":0}]
[null,"TOPLAM",{"$f":"SUM(C105:C107)","v":1},{"$f":"SUM(D105:D107)","v":0},0,{"$f":"SUM(F105:F107)","v":0},{"$f":"SUM(G105:G107)","v":0},{"$f":"SUM(H105:H107)","v":0},null,0,0]
[null,"32/A UYGULANABİLECEK MATRAH (2.TEŞVİK BELGESİ)",{"$f":"D84","v":0},"KV MATRAHI","1 - 5 PUAN İNDİRİM OLMASAYDI HESAPLANAN KV TUTARI","1 -5 Puan İndirim Tutarı","1 -5 Puan İndirim Sonrasında Hesaplanan KV Tutarı","32/A İndirimi Olmasaydı Ödenecek KV Tutarı","1 - 5 Puan İndirim ve 32/A VİO Uygulandıktan Sonra Tatbik Edilecek KV Oranı","1-5  Puan İndirim ve 32/A İndirimi Uygulandıktan Sonra Ödenecek  KV Tutarı","Yararlanılan Yatırıma Katkı Tutarı\n(32/A İnd. KV Nedeniyle Vazgeçilen Vergi Tutarı)","Ödenecek KV Tutarı"]
[null,"GENEL ORANA TABİ KISIM (DİĞER FAALİYETLER)",{"$f":"F93","v":0.3},{"$f":"C109*C110","v":0},{"$f":"D110*$H$94","v":0},0,{"$f":"E110-F110","v":0},{"$f":"G110","v":0},{"$f":"($H$94)-(($H$94)*D82)","v":0.25},{"$f":"I110*D110","v":0},{"$f":"G110-J110","v":0},{"$f":"J113","v":0}]
[null,"1 PUAN İNDİRİMLİ ORANA TABİ KISIM  (İMALAT)",{"$f":"E93","v":0.7},{"$f":"C109*C111","v":0},{"$f":"D111*$H$94","v":0},{"$f":"D111/100","v":0},{"$f":"E111-F111","v":0},{"$f":"G111","v":0},{"$f":"($H$94-0.01)-(($H$94-0.01)*D82)","v":0.24},{"$f":"I111*D111","v":0},{"$f":"G111-J111","v":0}]
[null,"5 PUAN İNDİRİMLİ ORANA TABİ KISIM  ( İHRACAT)",{"$f":"D93","v":0},{"$f":"C109*C112","v":0},{"$f":"D112*$H$94","v":0},{"$f":"D112/20","v":0},{"$f":"E112-F112","v":0},0,{"$f":"($H$94-0.05)-(($H$94-0.05)*D82)","v":0.2},0,{"$f":"G112-J112","v":0}]
[null,"TOPLAM",{"$f":"SUM(C110:C112)","v":1},0,0,{"$f":"SUM(F110:F112)","v":0},{"$f":"SUM(G110:G112)","v":0},{"$f":"SUM(H110:H112)","v":0},null,{"$f":"SUM(J110:J112)","v":0},0]
[null,"32/A UYGULANABİLECEK MATRAH (3.TEŞVİK BELGESİ)",{"$f":"E84","v":0},"KV MATRAHI","1 - 5 PUAN İNDİRİM OLMASAYDI HESAPLANAN KV TUTARI","1-5 Puan İndirim Tutarı","1 - 5 Puan İndirim Sonrasında Hesaplanan KV Tutarı","32/A İndirimi Olmasaydı Ödenecek KV Tutarı","1 - 5 Puan İndirim ve 32/A VİO Uygulandıktan Sonra Tatbik Edilecek KV Oranı","1 -5 Puan İndirim ve 32/A İndirimi Uygulandıktan Sonra Ödenecek  KV Tutarı","Yararlanılan Yatırıma Katkı Tutarı\n(32/A İnd. KV Nedeniyle Vazgeçilen Vergi Tutarı)","Ödenecek KV Tutarı"]
[null,"GENEL ORANA TABİ KISIM (DİĞER FAALİYETLER)",{"$f":"F93","v":0.3},{"$f":"C114*C115","v":0},{"$f":"D115*$H$94","v":0},0,{"$f":"E115-F115","v":0},{"$f":"G115","v":0},{"$f":"($H$94)-(($H$94)*E82)","v":0.25},{"$f":"I115*D115","v":0},{"$f":"G115-J115","v":0},{"$f":"J118","v":0}]
[null,"1 PUAN İNDİRİMLİ ORANA TABİ KISIM  (İMALAT)",{"$f":"E93","v":0.7},{"$f":"C114*C116","v":0},{"$f":"D116*$H$94","v":0},{"$f":"D116/100","v":0},{"$f":"E116-F116","v":0},{"$f":"G116","v":0},{"$f":"($H$94-0.01)-(($H$94-0.01)*E82)","v":0.24},{"$f":"I116*D116","v":0},{"$f":"G116-J116","v":0}]
[null,"5 PUAN İNDİRİMLİ ORANA TABİ KISIM  ( İHRACAT)",{"$f":"D93","v":0},{"$f":"C114*C117","v":0},{"$f":"D117*$H$94","v":0},{"$f":"D117/20","v":0},{"$f":"E117-F117","v":0},0,{"$f":"($H$94-0.05)-(($H$94-0.05)*E82)","v":0.2},0,{"$f":"G117-J117","v":0}]
[null,"TOPLAM",{"$f":"SUM(C115:C117)","v":1},0,0,{"$f":"SUM(F115:F117)","v":0},{"$f":"SUM(G115:G117)","v":0},{"$f":"SUM(H115:H117)","v":0},null,{"$f":"SUM(J115:J117)","v":0},0]
[null,"32/A UYGULANABİLECEK MATRAH (4. TEŞVİK BELGESİ)",{"$f":"F84","v":0},"KV MATRAHI","1 - 5 PUAN İNDİRİM OLMASAYDI HESAPLANAN KV TUTARI","1-5 Puan İndirim Tutarı","1 -5 Puan İndirim Sonrasında Hesaplanan KV Tutarı","32/A İndirimi Olmasaydı Ödenecek KV Tutarı","1- 5  Puan İndirim ve 32/A VİO Uygulandıktan Sonra Tatbik Edilecek KV Oranı","1-5 Puan İndirim ve 32/A İndirimi Uygulandıktan Sonra Ödenecek  KV Tutarı","Yararlanılan Yatırıma Katkı Tutarı\n(32/A İnd. KV Nedeniyle Vazgeçilen Vergi Tutarı)","Ödenecek KV Tutarı"]
[null,"GENEL ORANA TABİ KISIM (DİĞER FAALİYETLER)",{"$f":"F93","v":0.3},{"$f":"C119*C120","v":0},{"$f":"D120*$H$94","v":0},0,{"$f":"E120-F120","v":0},{"$f":"G120","v":0},{"$f":"($H$94)-(($H$94)*F82)","v":0.25},{"$f":"I120*D120","v":0},{"$f":"G120-J120","v":0},{"$f":"J123","v":0}]
[null,"1 PUAN İNDİRİMLİ ORANA TABİ KISIM  (İMALAT)",{"$f":"E93","v":0.7},{"$f":"C119*C121","v":0},{"$f":"D121*$H$94","v":0},{"$f":"D121/100","v":0},{"$f":"E121-F121","v":0},{"$f":"G121","v":0},{"$f":"($H$94-0.01)-(($H$94-0.01)*F82)","v":0.24},{"$f":"I121*D121","v":0},{"$f":"G121-J121","v":0}]
[null,"5 PUAN İNDİRİMLİ ORANA TABİ KISIM  ( İHRACAT)",{"$f":"D93","v":0},{"$f":"C119*C122","v":0},{"$f":"D122*$H$94","v":0},{"$f":"D122/20","v":0},{"$f":"E122-F122","v":0},0,{"$f":"($H$94-0.05)-(($H$94-0.05)*F82)","v":0.2},0,{"$f":"G122-J122","v":0}]
[null,"TOPLAM",{"$f":"SUM(C120:C122)","v":1},0,0,{"$f":"SUM(F120:F122)","v":0},{"$f":"SUM(G120:G122)","v":0},{"$f":"SUM(H120:H122)","v":0},null,{"$f":"SUM(J120:J122)","v":0},0]
[null,"32/A UYGULANABİLECEK MATRAH (5.TEŞVİK BELGESİ)",{"$f":"G84","v":0},"KV MATRAHI","1 - 5 PUAN İNDİRİM OLMASAYDI HESAPLANAN KV TUTARI","1-5 Puan İndirim Tutarı","1 - 5 Puan İndirim Sonrasında Hesaplanan KV Tutarı","32/A İndirimi Olmasaydı Ödenecek KV Tutarı","1 -5 Puan İndirim ve 32/A VİO Uygulandıktan Sonra Tatbik Edilecek KV Oranı","1 - 5 Puan İndirim ve 32/A İndirimi Uygulandıktan Sonra Ödenecek  KV Tutarı","Yararlanılan Yatırıma Katkı Tutarı\n(32/A İnd. KV Nedeniyle Vazgeçilen Vergi Tutarı)","Ödenecek KV Tutarı"]
[null,"GENEL ORANA TABİ KISIM (DİĞER FAALİYETLER)",{"$f":"F93","v":0.3},{"$f":"C124*C125","v":0},{"$f":"D125*$H$94","v":0},0,{"$f":"E125-F125","v":0},{"$f":"G125","v":0},{"$f":"($H$94)-(($H$94)*G82)","v":0.25},{"$f":"I125*D125","v":0},{"$f":"G125-J125","v":0},{"$f":"J128","v":0}]
[null,"1 PUAN İNDİRİMLİ ORANA TABİ KISIM  (İMALAT)",{"$f":"E93","v":0.7},{"$f":"C124*C126","v":0},{"$f":"D126*$H$94","v":0},{"$f":"D126/100","v":0},{"$f":"E126-F126","v":0},{"$f":"G126","v":0},{"$f":"($H$94-0.01)-(($H$94-0.01)*G82)","v":0.24},{"$f":"I126*D126","v":0},{"$f":"G126-J126","v":0}]
[null,"5 PUAN İNDİRİMLİ ORANA TABİ KISIM  ( İHRACAT)",{"$f":"D93","v":0},{"$f":"C124*C127","v":0},{"$f":"D127*$H$94","v":0},{"$f":"D127/20","v":0},{"$f":"E127-F127","v":0},0,{"$f":"($H$94-0.05)-(($H$94-0.05)*G82)","v":0.2},0,{"$f":"G127-J127","v":0}]
[null,"TOPLAM",{"$f":"SUM(C125:C127)","v":1},0,0,{"$f":"SUM(F125:F127)","v":0},{"$f":"SUM(G125:G127)","v":0},{"$f":"SUM(H125:H127)","v":0},null,{"$f":"SUM(J125:J127)","v":0},0]
[null,"32/A UYGULANAMAYACAK MATRAH",{"$f":"IF(C85<=0,0,C85)","v":1300000},"KV MATRAHI","1-5 PUAN İNDİRİM OLMASAYDI HESAPLANAN KV TUTARI","1-5 Puan İndirim Tutarı","1 -5 Puan İndirim Sonrasında Hesaplanan KV Tutarı","32/A İNDİRİMİ UYGULANMAZ",null,"1 Puan İndirim ve 32/A İndirimi Uygulandıktan Sonra Ödenecek  KV Tutarı","Yararlanılan Yatırıma Katkı Tutarı\n(32/A İnd. KV Nedeniyle Vazgeçilen Vergi Tutarı)","Ödenecek KV Tutarı"]
[null,"GENEL ORANA TABİ KISIM (DİĞER FAALİYETLER)",{"$f":"F93","v":0.3},{"$f":"C129*C130","v":390000},{"$f":"D130*$H$94","v":97500},0,{"$f":"E130-F130","v":97500},null,null,{"$f":"G130","v":97500},{"$f":"G130-J130","v":0},{"$f":"J133","v":315900}]
[null,"1 PUAN İNDİRİMLİ ORANA TABİ KISIM  (İMALAT)",{"$f":"E93","v":0.7},{"$f":"C131*C129","v":910000},{"$f":"D131*$H$94","v":227500},{"$f":"D131/100","v":9100},{"$f":"E131-F131","v":218400},null,null,{"$f":"G131","v":218400},{"$f":"G131-J131","v":0}]
[null,"5 PUAN İNDİRİMLİ ORANA TABİ KISIM  ( İHRACAT)",{"$f":"D93","v":0},{"$f":"C132*C129","v":0},{"$f":"D132*$H$94","v":0},{"$f":"D132/20","v":0},{"$f":"E132-F132","v":0},null,null,0,0]
[null,"TOPLAM",{"$f":"SUM(C130:C132)","v":1},{"$f":"SUM(D130:D132)","v":1300000},325000,{"$f":"SUM(F130:F132)","v":9100},{"$f":"SUM(G130:G132)","v":315900},null,null,315900,0]
[null,"TOPLAM KV MATRAHI VE ÖDENMESİ GEREKEN KV ",{"$f":"C104+C129+C109+C114+C119+C124","v":1300000},{"$f":"D108+D133+D113+D118+D123+D128","v":1300000},{"$f":"E108+E133+E113+E118+E123+E128","v":325000},{"$f":"F108+F133+F113+F118+F123+F128","v":9100},{"$f":"G108+G133+G113+G118+G123+G128","v":315900},null,null,{"$f":"J108+J133+J113+J118+J123+J128","v":315900},{"$f":"K133+K108+K113+K118+K123+K128","v":0},{"$f":"L105+L130+L110+L115+L120+L125","v":315900}]
[]
[null,"GEÇİCİ VERGİ BEYANNMESİNDE MATRAH BİLDİRİMİ BÖLÜMÜNDE DOLDURULACAK KISIMLAR VE TUTARLARI"]
[null,"32 A Madde Kapsamında İndirimli Kurumlar Vergisine (Geçici Vergiye) Tabi Matrah",{"$f":"C104+C109+C114+C119+C124","v":0},{"$f":"E108+E113+E118+E123+E128","v":0},"1-5 Puan Olmasaydı Hesaplan KV Tutarı"]
[null,null,null,{"$f":"G108+G113+G118+G123++G128","v":0},"1 -5 Puan İndirim Sonrasında Ödenecek KV Tutarı\n (32 A olmasaydı hesaplanacak Vergi)"]
[null,null,null,{"$f":"K108+K113+K118+K123+K128","v":0},"32/A İndirimi ile Vazgeçilen Vergi"]
[null,"32 A Madde Kapsamında İndirimli Kurumlar Vergisi(Geçici Vergi) Oranı",{"$f":"IFERROR(D140/C137,0)","v":0},{"$f":"L105+L110+L115+L120+L125","v":0},"32/A ya Tabi Matrah Üzerinden Ödenecek KV"]
[null,"32/7 Madde Kapsamında İndirimli Kurumlar Vergisine (Geçici Vergiye) Tabi Matrah  (İhracat)",{"$f":"D132","v":0},{"$f":"E132","v":0},"5 Puan Olmasaydı Hesaplan KV Tutarı"]
[null,null,null,{"$f":"F132","v":0},"5 Puan İndirimin Vergi Etkisi "]
[null,"32/7 Madde Kapsamında İndirimli Kurumlar Vergisi (Geçici Vergi) Oranı",{"$f":"IFERROR(D143/C141,0)","v":0},{"$f":"G132","v":0},"5 Puan İndirim Sonrasında Ödenecek KV Tutarı (İhracat)\n"]
[null,"32/8 Madde Kapsamında İndirimli Kurumlar Vergisine (Geçici Vergiye) Tabi Matrah  (Üretim)",{"$f":"D131","v":910000},{"$f":"E131","v":227500},"1 Puan Olmasaydı Hesaplan KV Tutarı"]
[null,null,null,{"$f":"F131","v":9100},"1 Puan İndirimin Vergi Etkisi "]
[null,"32/8 Madde Kapsamında İndirimli Kurumlar Vergisi (Geçici Vergi) Oranı",{"$f":"IFERROR(D146/C144,0)","v":0.24},{"$f":"G131","v":218400},"1 Puan İndirim Sonrasında Ödenecek KV Tutarı (Üretim)\n"]
[null,"Genel Orana Tabi Matrah (Diğer)",{"$f":"D130","v":390000},{"$f":"J130","v":97500},"Diğer Faalilyetlerden Elde Edilen Kazanç"]
[null,null,{"$f":"IFERROR(D147/C147,0)","v":0.25}]
[null,"MATRAHLAR TOPLAMI",{"$f":"C137+C144+C141+C147","v":1300000},{"$f":"D140+D146+D143+D147","v":315900}]

{"sheet":"Ü Ö2","index":8,"n_rows":149,"n_cols":12,"rows_kept":149,"cut":false,"hidden":true,"merged":[[84,2,84,6],[1,1,2,1],[59,1,59,2],[60,1,60,2],[71,1,72,1],[73,1,73,2],[74,1,74,2],[74,3,74,4],[75,1,75,2],[75,3,75,4],[79,1,79,3],[82,2,82,6],[85,2,85,6],[87,1,89,1],[87,2,88,2],[87,3,88,3],[87,4,88,4],[87,5,88,5],[135,1,135,4],[137,1,138,2],[104,11,107,11],[109,11,112,11],[114,11,117,11],[119,11,122,11],[124,11,127,11],[128,7,133,8],[129,11,132,11]]}
[]
[null,"FAALİYET TÜRLERİ İTİBARİYLE HASILATLAR VE TOPLAM İÇİNDEKİ ORANLARI",{"$f":"IFERROR(C4/C4,0)","v":1},{"$f":"IFERROR(D4/C4,0)","v":0},{"$f":"IFERROR(E4/C4,0)","v":0.4},{"$f":"IFERROR(F4/C4,0)","v":0.6}]
[null,null,"Toplam Hasılat","İhracat faaliyeti","İmalat faaliyeti","Diğer faaliyetler"]
[null,"A-BRÜT SATIŞLAR (60)",{"$f":"D4+E4+F4","v":2000000},{"$f":"SUM(D5:D7)","v":0},{"$f":"SUM(E5:E7)","v":800000},1200000]
[null,"1-Yurtiçi Satışlar (600)",{"$f":"D5+E5+F5","v":2600000},null,2600000,0]
[null,"2-Yurtdışı Satışlar (601)",{"$f":"D6+E6+F6","v":0},0]
[null,"3-Diğer Gelirler (602)",{"$f":"D7+E7+F7","v":-600000},null,-1800000,1200000]
[null,"B-SATIŞ İNDİRİMLERİ(-) (61)",{"$f":"SUM(C9:C11)","v":0},{"$f":"SUM(D9:D11)","v":0},{"$f":"SUM(E9:E11)","v":0},0]
[null,"1-Satıştan İadeler (-) (610)",{"$f":"SUM(D9:F9)","v":0}]
[null,"2- Satış İskontoları (-) (611)",{"$f":"SUM(D10:F10)","v":0}]
[null,"3-Diğer İndirimler (-) (612)",0]
[null,"C-NET SATIŞLAR",{"$f":"C4-C8","v":2000000},{"$f":"D4-D8","v":0},{"$f":"E4-E8","v":800000},1200000]
[null,"D-SATIŞLARIN MALİYETİ (-) (62)",{"$f":"SUM(C14:C17)","v":0},{"$f":"SUM(D14:D17)","v":0},{"$f":"SUM(E14:E17)","v":0},{"$f":"SUM(F14:F17)","v":0}]
[null,"1-Satılan Mamuller Maliyeti ( 620)",{"$f":"SUM(D14:F14)","v":0}]
[null,"2-Satılan Ticari Mal Maliyeti (621)",{"$f":"SUM(D15:F15)","v":0}]
[null,"3-Satılan Hizmet Maliyeti (622)",0]
[null,"4-Diğer Satışların Maliyeti (623)",0]
[null,"BRÜT SATIŞ KARI / ZARARI",{"$f":"C12-C13","v":2000000},{"$f":"D12-D13","v":0},{"$f":"E12-E13","v":800000},1200000]
[null,"E-FAALİYET GİDERLERİ (-) (63)",{"$f":"SUM(C20:C24)","v":0},{"$f":"SUM(D20:D24)","v":0},{"$f":"SUM(E20:E24)","v":0},0]
[null,"1-Araştırma ve Geliştirme Giderleri(-) (630)",{"$f":"SUM(D20:F20)","v":0}]
[null,"2-Pazarlama, Satış ve Dağıtım Giderleri(-) (631)",{"$f":"SUM(D21:F21)","v":0}]
[null,"3-Genel Yönetim Giderleri(-) (632)",{"$f":"SUM(D22:F22)","v":0}]
[null,"MÜŞTEREK GENEL GİDERLER (DAĞITIM-HASILAT PAYINA GÖRE)",null,{"$f":"C23*D2","v":0},{"$f":"C23*E2","v":0},{"$f":"C23*F2","v":0}]
[null,"MÜŞTEREK GENEL GİDER GİBİ DAĞITIMA TABİ TUTULACAK AMORTİSMAN GİDERLERİ  (DAĞITIM-HASILAT PAYINA GÖRE)",null,{"$f":"C24*D2","v":0},{"$f":"C24*E2","v":0},{"$f":"C24*F2","v":0}]
[null,"FAALİYET KARI / ZARARI ",{"$f":"C18-C19","v":2000000},{"$f":"D18-D19","v":0},{"$f":"E18-E19","v":800000},1200000]
[null,"F-DİĞER FAALİYETLERDEN OLAĞAN GELİR VE KARLAR (64)",{"$f":"SUM(C27:C35)","v":0},{"$f":"SUM(D27:D35)","v":0},{"$f":"SUM(E27:E35)","v":0},{"$f":"SUM(F27:F35)","v":0}]
[null,"         1- İŞTİRAKLERDEN TEMETTÜ GELİRLERİ (640)",{"$f":"SUM(D27:F27)","v":0}]
[null,"         2- BAĞLI ORTAKLIKLARDAN TEMETTÜ GELİRLERİ (641)",{"$f":"SUM(D28:F28)","v":0}]
[null,"         3- FAİZ GELİRLERİ (642) (ihracat ve imalat kaynaklı alacağın tahsiline kadar olan süreçte oluşan)",0]
[null,"         4- KOMİSYON GELİRLERİ (643)",0]
[null,"         5- KONUSU OLMAYAN KARŞILIKLAR (644)",0]
[null,"         6- MENKUL KIYMET SATIŞ KARLARI (645)",0]
[null,"         7- KAMBİYO KARLARI (646) (ihracat ve imalat kaynaklı alacağın tahsiline kadar olan süreçte oluşan)",0]
[null,"         8- REESKONT FAİZ GELİRLERİ (647)",0]
[null,"         9- FAALİYETLE İLGİLİ DİĞER GELİR VE KARLAR (649)",0]
[null,"ARA TOPLAM",{"$f":"C25+C26","v":2000000},{"$f":"D25+D26","v":0},{"$f":"E25+E26","v":800000},{"$f":"F25+F26","v":1200000}]
[null,"G-DİĞER FAALİYETLERDEN OLAĞAN GİDER VE ZARARLAR(-) (65)",{"$f":"SUM(C38:C43)","v":0},{"$f":"SUM(D38:D43)","v":0},{"$f":"SUM(E38:E43)","v":0},0]
[null,"         1- KOMİSYON GİDERLERİ (653)",{"$f":"SUM(D38:F38)","v":0}]
[null,"         2- KARŞILIK GİDERLERİ (654)",{"$f":"SUM(D39:F39)","v":0}]
[null,"         3- MENKUL KIYMET SATIŞ ZARARLARI (655)",0]
[null,"         4- KAMBİYO ZARARLARI (656) (ihracat ve imalat kaynaklı alacağın tahsiline kadar olan süreçte oluşan)",0]
[null,"         5- REESKONT FAİZ GİDERLERİ (657)",0]
[null,"         6- DİĞER OLAĞAN GİDER VE ZARARLAR (659)",{"$f":"SUM(D43:F43)","v":0}]
[null,"ARA TOPLAM",{"$f":"C36-C37","v":2000000},{"$f":"D36-D37","v":0},{"$f":"E36-E37","v":800000},1200000]
[null,"H-FİNANSMAN GİDERLERİ(-) (66)",{"$f":"SUM(C46:C49)","v":0},{"$f":"SUM(D46:D49)","v":0},{"$f":"SUM(E46:E49)","v":0},{"$f":"SUM(F46:F49)","v":0}]
[null,"         1- KISA VADELİ BORÇLANMA GİDERLERİ (-)",{"$f":"SUM(D46:F46)","v":0}]
[null,"         2- UZUN VADELİ BORÇLANMA GİDERLERİ (-)",{"$f":"SUM(D47:F47)","v":0}]
[null,"         1- KISA VADELİ BORÇLANMA GİDERLERİ (-) (DAĞITIM)",null,{"$f":"C48*D2","v":0},{"$f":"C48*E2","v":0},{"$f":"C48*F2","v":0}]
[null,"         2- UZUN VADELİ BORÇLANMA GİDERLERİ (-) (DAĞITIM)",null,{"$f":"C49*D2","v":0},{"$f":"C49*E2","v":0},{"$f":"C49*F2","v":0}]
[null,"ARA TOPLAM",{"$f":"C44-C45","v":2000000},{"$f":"D44-D45","v":0},{"$f":"E44-E45","v":800000},{"$f":"F44-F45","v":1200000}]
[null,"I-OLAĞANDIŞI GELİR VE KÂRLAR (67)",{"$f":"SUM(D51:F51)","v":0},{"$f":"SUM(D52:D53)","v":0},{"$f":"SUM(E52:E53)","v":0},{"$f":"SUM(F52:F53)","v":0}]
[null,"1- ÖNCEKİ DÖNEM GELİR VE KARLARI (671)",{"$f":"SUM(D52:F52)","v":0}]
[null,"2-DİĞER OLAĞAN DIŞI GELİR VE KARLAR (679)",{"$f":"SUM(D53:F53)","v":0}]
[null,"ARA TOPLAM",{"$f":"SUM(D54:F54)","v":2000000},{"$f":"D50+D51","v":0},{"$f":"E50+E51","v":800000},1200000]
[null,"J-OLAĞANDIŞI GİDER VE ZARARLAR(-) (68)",{"$f":"SUM(C56:C58)","v":0},{"$f":"SUM(D56:D58)","v":0},{"$f":"SUM(E56:E58)","v":0},0]
[null,"1-Çalışmayan Kısım Gider ve Zararları(-) (680)",{"$f":"SUM(D56:F56)","v":0}]
[null,"2-Önceki Dönem Gider ve Zararları(-) (681)",{"$f":"SUM(D57:F57)","v":0}]
[null,"3-Diğer Olağan Dışı Gider ve Zararlar(-) (689)",0]
[null,"DÖNEM KÂRI VEYA ZARARI \n(TİCARİ BİLANÇO KARI ZARARI )",{"$f":"C54-C55","v":2000000},{"$f":"D54-D55","v":0},{"$f":"E54-E55","v":800000},1200000]
[null,"İHRACAT, İMALAT VE DİĞER FAALİYETLERDEN ELDE EDİLEN KAZANCIN TOPLAM TİCARİ KAZANÇ İÇİNDEKİ PAYLARI  \n\n(Kazançlar arasında Öncelik İhracat Kazancına Verilmiştir. İhrcat Kazancından arta kalan Ticari Kazanç İmalat ve Diğer Faaliyetlere Sayılmıştır.)\n\n",null,{"$f":"IF(D59>=$C$59,1,\n    IF(D59<=0,0,\n    IF(AND(D59>0,D59<$C$59),D59/$C$59)))","v":0},{"$f":"IF(E59>=$C$59,1,\n    IF(E59<=0,0,\n    IF(AND(E59>0,E59<$C$59),E59/$C$59)))","v":0.4},{"$f":"IF(F59>=$C$59,1,\n    IF(F59<=0,0,\n    IF(AND(F59>0,F59<$C$59),F59/$C$59)))","v":0.6}]
[null,null,null,{"$f":"D60/(D60+E60+F60)","v":0},{"$f":"E60/(D60+E60+F60)","v":0.4},{"$f":"F60/(D60+E60+F60)","v":0.6}]
[]
[null,"KKEG +",1000000]
[null," KABUL EDİLMEYEN GELİRLER -"]
[null,"ZARAR OLSA DAHİ İNDİRİLECEK İSTİSNALAR -",{"$f":"C66+C67+C68","v":0}]
[null,"Hizmet İhracatı Faaliyetinden (KVK 10-1/ğ) Elde Edilen Kazançlardan İstisna Edilenlerin Toplamı"]
[null,"İmalat Faaliyetinden Elde Edilen Kazançlardan İstisna Edilenlerin Toplamı"]
[null,"Diğer Faaliyetlerden Elde Edilen Kazançlardan İstisna Edilenlerin Toplamı"]
[null,"GEÇMİŞ YIL ZARARLARI -",2000000]
[null,"İNDİRİMLER -",null,"AZAMİ YAZILABİLECEK İNDİRİMLER TUTARI",{"$f":"C59+C63-C64-C65-C69","v":1000000}]
[]
[null,"1 PUAN İNDİRİM UYGULANACAK TUTARIN HESABINDA İSTİSNA KAZANÇLAR DÜŞÜLDÜKTEN SONRA BULUNAN TİCARİ KAZANÇ TUTARI İLE  İHRACAT,İMALAT VE DİĞER KAZANÇLARIN TUTARI","TİCARİ KAZANÇ TAN İhracat ve İmalat Kazancından İstisna Olan Tutarlar Düşüldükten Sonra Kalan Tutarı","İhracat Faaliyetinden Elde Edilen  Kazançtan İstisna Olan Kısım Düşüldükten Sonra Bulunan Tutarı","Üretim  Faaliyetinden Elde Edilen  Kazançtan İstisna Olan Kısım Düşüldükten Sonra Bulunan Tutarı","Diğer Faaliyetinden Elde Edilen  Kazanç"]
[null,null,{"$f":"IF(C59-C66-C67<=0,0,C59-C66-C67)","v":2000000},{"$f":"IF($D$59-C66<=0,0,MIN($D$59-C66,$C$73*D61))","v":0},{"$f":"IF($E$59-C67<=0,0,MIN($E$59-C67,$C$73*E61))","v":800000},{"$f":"IF(C73-D73-E73<=0,0,C73-D73-E73)","v":1200000}]
[null,"MATRAH DAĞITIM PAYLARI",null,{"$f":"IFERROR(IF(D73/C73<=0,0,D73/C73),0)","v":0},{"$f":"IFERROR(IF(E73/C73<=0,0,E73/C73),0)","v":0.4},{"$f":"IFERROR(F73/C73,0)","v":0.6}]
[null,"İHRACAT, İMALAT VE DİĞER FAALİYETLERDEN ELDE EDİLEN KAZANCIN TOPLAM TİCARİ KAZANÇ İÇİNDEKİ PAYLARI ",null,{"$f":"IFERROR(IF(AND(D73+E73>C73, F73<=0),1,(D73+E73)/C73),0)","v":0.4},null,{"$f":"IFERROR(IF(F73<=0,0,F73/C73),0)","v":0.6}]
[null,"NEGATİF VE % 100 DEN BÜYÜKLÜK KONTROLÜ SONRASINDAKİ PAYLARI",null,{"$f":"IFERROR(IF(D75<=0,0,IF(D75>1,1,D75)),0)","v":0.4},null,{"$f":"IFERROR(IF(F75<=0,0,IF(F75>1,1,F75)),0)","v":0.6}]
[]
[null,"SAFİ KURUM KAZANCI \n(KURUMLAR VERGİSİ MATRAHI)",{"$f":"C59+C63-C64-C65-C69-C70","v":1000000},{"$f":"IF(C78<0, \"ZARAR\",\"KAR\")","v":"KAR"}]
[]
[null,"2022 YILI 3. DÖNEM İNDİRİMLİ KURUMLAR VERGİSİ HESAPLAMA TABLOSU"]
[null,null,"1. TEŞVİK BELGESİ","2. TEŞVİK BELGESİ","3. TEŞVİK BELGESİ","4. TEŞVİK BELGESİ","5. TEŞVİK BELGESİ"]
[null,"Vergi İndirim Oranı (VİO)"]
[null,"KV MATRAHI (Safi Kurum Kazancı)",{"$f":"C78","v":1000000}]
[null,"32/A  Uygulanacak K.V. Matrahı (HER BİR TEŞVİK BELGESİ KAPSAMINDA YARARLANILABİLECEK YATIRIMA KATKI TUTARININ MATRAHI BU HÜCRELERE YAZILMALIDIR)",null,null,null,null,null,{"$f":"IF(SUM(C84:G84)>C78,\"32/A İNDİRİMİ UYGULANACAK KAZANÇ, SAFİ KURUM KAZANCINDAN FAZLADIR\",SUM(C84:G84))","v":0}]
[null,"32/A UYGULANMAYACAK K.V.  Matrahı",{"$f":"IF(C83-(C84+D84+E84+F84+G84)<0,0,C83-(C84+D84+E84+F84+G84))","v":1000000}]
[null,"MATRAH TOPLAMI",{"$f":"IF((C84+D84+E84+F84+G84+C85)>C78,C78,(C84+D84+E84+F84+G84+C85))","v":1000000}]
[]
[null,"SAFİ KURUM KAZANCININ  KV VERGİ ORANLARI İTİBARİYLE DAĞILIMI ","TOPLAM SAFİ KAZANÇ","İhracat Kazancı Payı","Üretim Kazancı Payı","Diğer Faaliyet Kazancı Payı"]
[]
[null,null,{"$f":"C78","v":1000000},{"$f":"IF(AND(AND($D$59>0,($D$59+$E$59)>=$C$59,D59>=C66),$C$90>=MAX(D59,D73)),\n\nMIN(MAX(IF(D59<=C90,D59,IF(D73<=C90,D73)),$C$90*D74)),\n\nIF(OR(D59<=0,D73<=0),0,\n\nMIN( MAX(   MAX(   IF(D59<=C90,D59),  IF(D73<=C90,D73) ),    MIN($C$90*D74,D59,D73)),$C$90)))","v":0},{"$f":"MIN( IF(AND(AND($E$59>0,($D$59+$E$59)>=$C$59,E59>=C67),$C$90>=MAX(E59,E73)),\n\nMIN(MAX(IF(E59<=C90,E59,IF(E73<=C90,E73)),$C$90*E74)),\n\nIF(OR(E59<=0,E73<=0),0,\n\nMIN( MAX(   MAX(   IF(E59<=C90,E59),  IF(E73<=C90,E73) ),    MIN($C$90*E74,E59,E73)),$C$90))),C90-D90)","v":800000},{"$f":"C90-D90-E90","v":200000}]
[null,"SAFİ KURUM KAZANCININ DAĞILIMI ORANSAL DAĞILIMI",{"$f":"C90","v":1000000},{"$f":"D90/C90","v":0},{"$f":"E90/C90","v":0.8},{"$f":"F90/C90","v":0.2}]
[null,"SAFİ KURUM KAZANCININ DAĞILIMI TUTARSAL",{"$f":"C91","v":1000000},{"$f":"D90","v":0},{"$f":"E90","v":800000},{"$f":"F90","v":200000}]
[null,"SAFİ KURUM KAZANCI DAĞILIMI",{"$f":"C92","v":1000000},{"$f":"IFERROR(IF(D92/C92>=1,1,D92/C92),0)","v":0},{"$f":"IFERROR(IF(E92/C92>=1,1,E92/C92),0)","v":0.8},{"$f":"IFERROR(IF(F92/C92>=1,1,F92/C92),0)","v":0.2},null,"KV ORANI"]
[null,"1 PUAN VE 32/A İNDİRİMİ OLMASAYDI HESAPLANAN KV TUTARI",{"$f":"C93*$H$94","v":250000},{"$f":"D92*$H$94","v":0},{"$f":"E92*$H$94","v":200000},{"$f":"F92*$H$94","v":50000},null,0.25]
[null,"32/ A UYGULANAN MATRAH",{"$f":"C84+D84+E84+F84+G84","v":0},{"$f":"D107+D112+D117+D122+D127","v":0},{"$f":"D106+D111+D116+D121+D126","v":0},{"$f":"D105+D110+D115+D120+D125","v":0}]
[null,"32/A UYGULANACAK MATRAH ÜZERİNDEN ÖDENECEK KV TUTARI",{"$f":"J108+J113+J118+J123+J128","v":0},{"$f":"J107+J112+J117+J122+J127","v":0},{"$f":"J106+J111+J116+J121+J126","v":0},{"$f":"J105+J110+J115+J120+J125","v":0}]
[null,"32/A UYGULANMAYAN MATRAH",{"$f":"IF(C85<=0,0,C85)","v":1000000},{"$f":"D132","v":0},{"$f":"D131","v":800000},{"$f":"D130","v":200000}]
[null,"32/A UYGULANMAYAN MATRAH ÜZERİNDEN ÖDENECEK KV TUTARI",{"$f":"L130","v":242000},{"$f":"J132","v":0},{"$f":"J131","v":192000},{"$f":"J130","v":50000}]
[null,"TOPLAM ÖDENECEK KV",{"$f":"C96+C98","v":242000},{"$f":"J132+J107","v":0},{"$f":"J131+J106","v":192000},{"$f":"J130+J105","v":50000}]
[null,"TOPLAM AVANTAJ  (YARARLANILAN 1 PUAN İNDİRİMİ + 32/A İNDİRİMİ TUTARI )",{"$f":"C94-C99","v":8000},{"$f":"D101+D102","v":0},{"$f":"E101+E102","v":8000},{"$f":"F101+F102","v":0}]
[null,"YARARLANILAN 1 - 5 PUAN İNDİRİMİ TUTARI",{"$f":"F133+F128+F123+F118+F113+F108","v":8000},{"$f":"F132+F107+F112+F117+F122+F127","v":0},{"$f":"F131+F106+F111+F116+F121+F126","v":8000},{"$f":"F130+F105+F110+F115+F120+F125","v":0}]
[null,"YARLANILAN 32/A İNDİRİMİ TUTARI",{"$f":"K108+K113+K118+K123+K128+K133","v":0},{"$f":"K107+K112+K122+K127+K132","v":0},{"$f":"K106+K111+K116+K121+K126+K131","v":0},{"$f":"K105++K110+K115+K120+K125+K130","v":0}]
[]
[null,"32/A UYGULANABİLECEK MATRAH (1.TEŞVİK BELGESİ)",{"$f":"C84","v":0},"KV MATRAHI","1 - 5 PUAN İNDİRİM OLMASAYDI HESAPLANAN KV TUTARI","1 -5 Puan İndirim Tutarı","1 - 5 Puan İndirim Sonrasında Hesaplanan KV Tutarı","32/A İndirimi Olmasaydı Ödenecek KV Tutarı","1 -5 Puan İndirim ve 32/A VİO Uygulandıktan Sonra Tatbik Edilecek KV Oranı","1 -5 Puan İndirim ve 32/A İndirimi Uygulandıktan Sonra Ödenecek  KV Tutarı","Yararlanılan Yatırıma Katkı Tutarı\n(32/A İnd. KV Nedeniyle Vazgeçilen Vergi Tutarı)","Ödenecek KV Tutarı"]
[null,"GENEL ORANA TABİ KISIM (DİĞER FAALİYETLER)",{"$f":"F93","v":0.2},{"$f":"C104*C105","v":0},{"$f":"D105*$H$94","v":0},0,{"$f":"E105-F105","v":0},{"$f":"G105","v":0},{"$f":"($H$94)-(($H$94)*$C$82)","v":0.25},{"$f":"I105*D105","v":0},{"$f":"G105-J105","v":0},{"$f":"J108","v":0}]
[null,"1 PUAN İNDİRİMLİ ORANA TABİ KISIM  (İMALAT)",{"$f":"E93","v":0.8},{"$f":"C104*C106","v":0},{"$f":"D106*$H$94","v":0},{"$f":"D106/100","v":0},{"$f":"E106-F106","v":0},{"$f":"G106","v":0},{"$f":"($H$94-0.01)-(($H$94-0.01)*$C$82)","v":0.24},{"$f":"I106*D106","v":0},{"$f":"G106-J106","v":0}]
[null,"5 PUAN İNDİRİMLİ ORANA TABİ KISIM  ( İHRACAT)",{"$f":"D93","v":0},{"$f":"C104*C107","v":0},{"$f":"D107*$H$94","v":0},{"$f":"D107/20","v":0},{"$f":"E107-F107","v":0},0,{"$f":"($H$94-0.05)-(($H$94-0.05)*C82)","v":0.2},0,{"$f":"G107-J107","v":0}]
[null,"TOPLAM",{"$f":"SUM(C105:C107)","v":1},{"$f":"SUM(D105:D107)","v":0},0,{"$f":"SUM(F105:F107)","v":0},{"$f":"SUM(G105:G107)","v":0},{"$f":"SUM(H105:H107)","v":0},null,0,0]
[null,"32/A UYGULANABİLECEK MATRAH (2.TEŞVİK BELGESİ)",{"$f":"D84","v":0},"KV MATRAHI","1 - 5 PUAN İNDİRİM OLMASAYDI HESAPLANAN KV TUTARI","1 -5 Puan İndirim Tutarı","1 -5 Puan İndirim Sonrasında Hesaplanan KV Tutarı","32/A İndirimi Olmasaydı Ödenecek KV Tutarı","1 - 5 Puan İndirim ve 32/A VİO Uygulandıktan Sonra Tatbik Edilecek KV Oranı","1-5  Puan İndirim ve 32/A İndirimi Uygulandıktan Sonra Ödenecek  KV Tutarı","Yararlanılan Yatırıma Katkı Tutarı\n(32/A İnd. KV Nedeniyle Vazgeçilen Vergi Tutarı)","Ödenecek KV Tutarı"]
[null,"GENEL ORANA TABİ KISIM (DİĞER FAALİYETLER)",{"$f":"F93","v":0.2},{"$f":"C109*C110","v":0},{"$f":"D110*$H$94","v":0},0,{"$f":"E110-F110","v":0},{"$f":"G110","v":0},{"$f":"($H$94)-(($H$94)*D82)","v":0.25},{"$f":"I110*D110","v":0},{"$f":"G110-J110","v":0},{"$f":"J113","v":0}]
[null,"1 PUAN İNDİRİMLİ ORANA TABİ KISIM  (İMALAT)",{"$f":"E93","v":0.8},{"$f":"C109*C111","v":0},{"$f":"D111*$H$94","v":0},{"$f":"D111/100","v":0},{"$f":"E111-F111","v":0},{"$f":"G111","v":0},{"$f":"($H$94-0.01)-(($H$94-0.01)*D82)","v":0.24},{"$f":"I111*D111","v":0},{"$f":"G111-J111","v":0}]
[null,"5 PUAN İNDİRİMLİ ORANA TABİ KISIM  ( İHRACAT)",{"$f":"D93","v":0},{"$f":"C109*C112","v":0},{"$f":"D112*$H$94","v":0},{"$f":"D112/20","v":0},{"$f":"E112-F112","v":0},0,{"$f":"($H$94-0.05)-(($H$94-0.05)*D82)","v":0.2},0,{"$f":"G112-J112","v":0}]
[null,"TOPLAM",{"$f":"SUM(C110:C112)","v":1},0,0,{"$f":"SUM(F110:F112)","v":0},{"$f":"SUM(G110:G112)","v":0},{"$f":"SUM(H110:H112)","v":0},null,{"$f":"SUM(J110:J112)","v":0},0]
[null,"32/A UYGULANABİLECEK MATRAH (3.TEŞVİK BELGESİ)",{"$f":"E84","v":0},"KV MATRAHI","1 - 5 PUAN İNDİRİM OLMASAYDI HESAPLANAN KV TUTARI","1-5 Puan İndirim Tutarı","1 - 5 Puan İndirim Sonrasında Hesaplanan KV Tutarı","32/A İndirimi Olmasaydı Ödenecek KV Tutarı","1 - 5 Puan İndirim ve 32/A VİO Uygulandıktan Sonra Tatbik Edilecek KV Oranı","1 -5 Puan İndirim ve 32/A İndirimi Uygulandıktan Sonra Ödenecek  KV Tutarı","Yararlanılan Yatırıma Katkı Tutarı\n(32/A İnd. KV Nedeniyle Vazgeçilen Vergi Tutarı)","Ödenecek KV Tutarı"]
[null,"GENEL ORANA TABİ KISIM (DİĞER FAALİYETLER)",{"$f":"F93","v":0.2},{"$f":"C114*C115","v":0},{"$f":"D115*$H$94","v":0},0,{"$f":"E115-F115","v":0},{"$f":"G115","v":0},{"$f":"($H$94)-(($H$94)*E82)","v":0.25},{"$f":"I115*D115","v":0},{"$f":"G115-J115","v":0},{"$f":"J118","v":0}]
[null,"1 PUAN İNDİRİMLİ ORANA TABİ KISIM  (İMALAT)",{"$f":"E93","v":0.8},{"$f":"C114*C116","v":0},{"$f":"D116*$H$94","v":0},{"$f":"D116/100","v":0},{"$f":"E116-F116","v":0},{"$f":"G116","v":0},{"$f":"($H$94-0.01)-(($H$94-0.01)*E82)","v":0.24},{"$f":"I116*D116","v":0},{"$f":"G116-J116","v":0}]
[null,"5 PUAN İNDİRİMLİ ORANA TABİ KISIM  ( İHRACAT)",{"$f":"D93","v":0},{"$f":"C114*C117","v":0},{"$f":"D117*$H$94","v":0},{"$f":"D117/20","v":0},{"$f":"E117-F117","v":0},0,{"$f":"($H$94-0.05)-(($H$94-0.05)*E82)","v":0.2},0,{"$f":"G117-J117","v":0}]
[null,"TOPLAM",{"$f":"SUM(C115:C117)","v":1},0,0,{"$f":"SUM(F115:F117)","v":0},{"$f":"SUM(G115:G117)","v":0},{"$f":"SUM(H115:H117)","v":0},null,{"$f":"SUM(J115:J117)","v":0},0]
[null,"32/A UYGULANABİLECEK MATRAH (4. TEŞVİK BELGESİ)",{"$f":"F84","v":0},"KV MATRAHI","1 - 5 PUAN İNDİRİM OLMASAYDI HESAPLANAN KV TUTARI","1-5 Puan İndirim Tutarı","1 -5 Puan İndirim Sonrasında Hesaplanan KV Tutarı","32/A İndirimi Olmasaydı Ödenecek KV Tutarı","1- 5  Puan İndirim ve 32/A VİO Uygulandıktan Sonra Tatbik Edilecek KV Oranı","1-5 Puan İndirim ve 32/A İndirimi Uygulandıktan Sonra Ödenecek  KV Tutarı","Yararlanılan Yatırıma Katkı Tutarı\n(32/A İnd. KV Nedeniyle Vazgeçilen Vergi Tutarı)","Ödenecek KV Tutarı"]
[null,"GENEL ORANA TABİ KISIM (DİĞER FAALİYETLER)",{"$f":"F93","v":0.2},{"$f":"C119*C120","v":0},{"$f":"D120*$H$94","v":0},0,{"$f":"E120-F120","v":0},{"$f":"G120","v":0},{"$f":"($H$94)-(($H$94)*F82)","v":0.25},{"$f":"I120*D120","v":0},{"$f":"G120-J120","v":0},{"$f":"J123","v":0}]
[null,"1 PUAN İNDİRİMLİ ORANA TABİ KISIM  (İMALAT)",{"$f":"E93","v":0.8},{"$f":"C119*C121","v":0},{"$f":"D121*$H$94","v":0},{"$f":"D121/100","v":0},{"$f":"E121-F121","v":0},{"$f":"G121","v":0},{"$f":"($H$94-0.01)-(($H$94-0.01)*F82)","v":0.24},{"$f":"I121*D121","v":0},{"$f":"G121-J121","v":0}]
[null,"5 PUAN İNDİRİMLİ ORANA TABİ KISIM  ( İHRACAT)",{"$f":"D93","v":0},{"$f":"C119*C122","v":0},{"$f":"D122*$H$94","v":0},{"$f":"D122/20","v":0},{"$f":"E122-F122","v":0},0,{"$f":"($H$94-0.05)-(($H$94-0.05)*F82)","v":0.2},0,{"$f":"G122-J122","v":0}]
[null,"TOPLAM",{"$f":"SUM(C120:C122)","v":1},0,0,{"$f":"SUM(F120:F122)","v":0},{"$f":"SUM(G120:G122)","v":0},{"$f":"SUM(H120:H122)","v":0},null,{"$f":"SUM(J120:J122)","v":0},0]
[null,"32/A UYGULANABİLECEK MATRAH (5.TEŞVİK BELGESİ)",{"$f":"G84","v":0},"KV MATRAHI","1 - 5 PUAN İNDİRİM OLMASAYDI HESAPLANAN KV TUTARI","1-5 Puan İndirim Tutarı","1 - 5 Puan İndirim Sonrasında Hesaplanan KV Tutarı","32/A İndirimi Olmasaydı Ödenecek KV Tutarı","1 -5 Puan İndirim ve 32/A VİO Uygulandıktan Sonra Tatbik Edilecek KV Oranı","1 - 5 Puan İndirim ve 32/A İndirimi Uygulandıktan Sonra Ödenecek  KV Tutarı","Yararlanılan Yatırıma Katkı Tutarı\n(32/A İnd. KV Nedeniyle Vazgeçilen Vergi Tutarı)","Ödenecek KV Tutarı"]
[null,"GENEL ORANA TABİ KISIM (DİĞER FAALİYETLER)",{"$f":"F93","v":0.2},{"$f":"C124*C125","v":0},{"$f":"D125*$H$94","v":0},0,{"$f":"E125-F125","v":0},{"$f":"G125","v":0},{"$f":"($H$94)-(($H$94)*G82)","v":0.25},{"$f":"I125*D125","v":0},{"$f":"G125-J125","v":0},{"$f":"J128","v":0}]
[null,"1 PUAN İNDİRİMLİ ORANA TABİ KISIM  (İMALAT)",{"$f":"E93","v":0.8},{"$f":"C124*C126","v":0},{"$f":"D126*$H$94","v":0},{"$f":"D126/100","v":0},{"$f":"E126-F126","v":0},{"$f":"G126","v":0},{"$f":"($H$94-0.01)-(($H$94-0.01)*G82)","v":0.24},{"$f":"I126*D126","v":0},{"$f":"G126-J126","v":0}]
[null,"5 PUAN İNDİRİMLİ ORANA TABİ KISIM  ( İHRACAT)",{"$f":"D93","v":0},{"$f":"C124*C127","v":0},{"$f":"D127*$H$94","v":0},{"$f":"D127/20","v":0},{"$f":"E127-F127","v":0},0,{"$f":"($H$94-0.05)-(($H$94-0.05)*G82)","v":0.2},0,{"$f":"G127-J127","v":0}]
[null,"TOPLAM",{"$f":"SUM(C125:C127)","v":1},0,0,{"$f":"SUM(F125:F127)","v":0},{"$f":"SUM(G125:G127)","v":0},{"$f":"SUM(H125:H127)","v":0},null,{"$f":"SUM(J125:J127)","v":0},0]
[null,"32/A UYGULANAMAYACAK MATRAH",{"$f":"IF(C85<=0,0,C85)","v":1000000},"KV MATRAHI","1-5 PUAN İNDİRİM OLMASAYDI HESAPLANAN KV TUTARI","1-5 Puan İndirim Tutarı","1 -5 Puan İndirim Sonrasında Hesaplanan KV Tutarı","32/A İNDİRİMİ UYGULANMAZ",null,"1 Puan İndirim ve 32/A İndirimi Uygulandıktan Sonra Ödenecek  KV Tutarı","Yararlanılan Yatırıma Katkı Tutarı\n(32/A İnd. KV Nedeniyle Vazgeçilen Vergi Tutarı)","Ödenecek KV Tutarı"]
[null,"GENEL ORANA TABİ KISIM (DİĞER FAALİYETLER)",{"$f":"F93","v":0.2},{"$f":"C129*C130","v":200000},{"$f":"D130*$H$94","v":50000},0,{"$f":"E130-F130","v":50000},null,null,{"$f":"G130","v":50000},{"$f":"G130-J130","v":0},{"$f":"J133","v":242000}]
[null,"1 PUAN İNDİRİMLİ ORANA TABİ KISIM  (İMALAT)",{"$f":"E93","v":0.8},{"$f":"C131*C129","v":800000},{"$f":"D131*$H$94","v":200000},{"$f":"D131/100","v":8000},{"$f":"E131-F131","v":192000},null,null,{"$f":"G131","v":192000},{"$f":"G131-J131","v":0}]
[null,"5 PUAN İNDİRİMLİ ORANA TABİ KISIM  ( İHRACAT)",{"$f":"D93","v":0},{"$f":"C132*C129","v":0},{"$f":"D132*$H$94","v":0},{"$f":"D132/20","v":0},{"$f":"E132-F132","v":0},null,null,0,0]
[null,"TOPLAM",{"$f":"SUM(C130:C132)","v":1},{"$f":"SUM(D130:D132)","v":1000000},250000,{"$f":"SUM(F130:F132)","v":8000},{"$f":"SUM(G130:G132)","v":242000},null,null,242000,0]
[null,"TOPLAM KV MATRAHI VE ÖDENMESİ GEREKEN KV ",{"$f":"C104+C129+C109+C114+C119+C124","v":1000000},{"$f":"D108+D133+D113+D118+D123+D128","v":1000000},{"$f":"E108+E133+E113+E118+E123+E128","v":250000},{"$f":"F108+F133+F113+F118+F123+F128","v":8000},{"$f":"G108+G133+G113+G118+G123+G128","v":242000},null,null,{"$f":"J108+J133+J113+J118+J123+J128","v":242000},{"$f":"K133+K108+K113+K118+K123+K128","v":0},{"$f":"L105+L130+L110+L115+L120+L125","v":242000}]
[]
[null,"GEÇİCİ VERGİ BEYANNMESİNDE MATRAH BİLDİRİMİ BÖLÜMÜNDE DOLDURULACAK KISIMLAR VE TUTARLARI"]
[null,"32 A Madde Kapsamında İndirimli Kurumlar Vergisine (Geçici Vergiye) Tabi Matrah",{"$f":"C104+C109+C114+C119+C124","v":0},{"$f":"E108+E113+E118+E123+E128","v":0},"1-5 Puan Olmasaydı Hesaplan KV Tutarı"]
[null,null,null,{"$f":"G108+G113+G118+G123++G128","v":0},"1 -5 Puan İndirim Sonrasında Ödenecek KV Tutarı\n (32 A olmasaydı hesaplanacak Vergi)"]
[null,null,null,{"$f":"K108+K113+K118+K123+K128","v":0},"32/A İndirimi ile Vazgeçilen Vergi"]
[null,"32 A Madde Kapsamında İndirimli Kurumlar Vergisi(Geçici Vergi) Oranı",{"$f":"IFERROR(D140/C137,0)","v":0},{"$f":"L105+L110+L115+L120+L125","v":0},"32/A ya Tabi Matrah Üzerinden Ödenecek KV"]
[null,"32/7 Madde Kapsamında İndirimli Kurumlar Vergisine (Geçici Vergiye) Tabi Matrah  (İhracat)",{"$f":"D132","v":0},{"$f":"E132","v":0},"5 Puan Olmasaydı Hesaplan KV Tutarı"]
[null,null,null,{"$f":"F132","v":0},"5 Puan İndirimin Vergi Etkisi "]
[null,"32/7 Madde Kapsamında İndirimli Kurumlar Vergisi (Geçici Vergi) Oranı",{"$f":"IFERROR(D143/C141,0)","v":0},{"$f":"G132","v":0},"5 Puan İndirim Sonrasında Ödenecek KV Tutarı (İhracat)\n"]
[null,"32/8 Madde Kapsamında İndirimli Kurumlar Vergisine (Geçici Vergiye) Tabi Matrah  (Üretim)",{"$f":"D131","v":800000},{"$f":"E131","v":200000},"1 Puan Olmasaydı Hesaplan KV Tutarı"]
[null,null,null,{"$f":"F131","v":8000},"1 Puan İndirimin Vergi Etkisi "]
[null,"32/8 Madde Kapsamında İndirimli Kurumlar Vergisi (Geçici Vergi) Oranı",{"$f":"IFERROR(D146/C144,0)","v":0.24},{"$f":"G131","v":192000},"1 Puan İndirim Sonrasında Ödenecek KV Tutarı (Üretim)\n"]
[null,"Genel Orana Tabi Matrah (Diğer)",{"$f":"D130","v":200000},{"$f":"J130","v":50000},"Diğer Faalilyetlerden Elde Edilen Kazanç"]
[null,null,{"$f":"IFERROR(D147/C147,0)","v":0.25}]
[null,"MATRAHLAR TOPLAMI",{"$f":"C137+C144+C141+C147","v":1000000},{"$f":"D140+D146+D143+D147","v":242000}]

{"sheet":"İÜ Ö1","index":9,"n_rows":149,"n_cols":12,"rows_kept":149,"cut":false,"hidden":true,"merged":[[84,2,84,6],[1,1,2,1],[59,1,59,2],[60,1,60,2],[71,1,72,1],[73,1,73,2],[74,1,74,2],[74,3,74,4],[75,1,75,2],[75,3,75,4],[79,1,79,3],[82,2,82,6],[85,2,85,6],[87,1,89,1],[87,2,88,2],[87,3,88,3],[87,4,88,4],[87,5,88,5],[135,1,135,4],[137,1,138,2],[104,11,107,11],[109,11,112,11],[114,11,117,11],[119,11,122,11],[124,11,127,11],[128,7,133,8],[129,11,132,11]]}
[]
[null,"FAALİYET TÜRLERİ İTİBARİYLE HASILATLAR VE TOPLAM İÇİNDEKİ ORANLARI",{"$f":"IFERROR(C4/C4,0)","v":1},{"$f":"IFERROR(D4/C4,0)","v":0.6},{"$f":"IFERROR(E4/C4,0)","v":0.4},{"$f":"IFERROR(F4/C4,0)","v":0}]
[null,null,"Toplam Hasılat","İhracat faaliyeti","İmalat faaliyeti","Diğer faaliyetler"]
[null,"A-BRÜT SATIŞLAR (60)",{"$f":"D4+E4+F4","v":1000000},{"$f":"SUM(D5:D7)","v":600000},{"$f":"SUM(E5:E7)","v":400000},0]
[null,"1-Yurtiçi Satışlar (600)",{"$f":"D5+E5+F5","v":400000},null,400000]
[null,"2-Yurtdışı Satışlar (601)",{"$f":"D6+E6+F6","v":600000},600000]
[null,"3-Diğer Gelirler (602)",{"$f":"D7+E7+F7","v":0}]
[null,"B-SATIŞ İNDİRİMLERİ(-) (61)",{"$f":"SUM(C9:C11)","v":0},{"$f":"SUM(D9:D11)","v":0},{"$f":"SUM(E9:E11)","v":0},0]
[null,"1-Satıştan İadeler (-) (610)",{"$f":"SUM(D9:F9)","v":0}]
[null,"2- Satış İskontoları (-) (611)",{"$f":"SUM(D10:F10)","v":0}]
[null,"3-Diğer İndirimler (-) (612)",0]
[null,"C-NET SATIŞLAR",{"$f":"C4-C8","v":1000000},{"$f":"D4-D8","v":600000},{"$f":"E4-E8","v":400000},0]
[null,"D-SATIŞLARIN MALİYETİ (-) (62)",{"$f":"SUM(C14:C17)","v":0},{"$f":"SUM(D14:D17)","v":0},{"$f":"SUM(E14:E17)","v":0},{"$f":"SUM(F14:F17)","v":0}]
[null,"1-Satılan Mamuller Maliyeti ( 620)",{"$f":"SUM(D14:F14)","v":0}]
[null,"2-Satılan Ticari Mal Maliyeti (621)",{"$f":"SUM(D15:F15)","v":0}]
[null,"3-Satılan Hizmet Maliyeti (622)",0]
[null,"4-Diğer Satışların Maliyeti (623)",0]
[null,"BRÜT SATIŞ KARI / ZARARI",{"$f":"C12-C13","v":1000000},{"$f":"D12-D13","v":600000},{"$f":"E12-E13","v":400000},0]
[null,"E-FAALİYET GİDERLERİ (-) (63)",{"$f":"SUM(C20:C24)","v":0},{"$f":"SUM(D20:D24)","v":0},{"$f":"SUM(E20:E24)","v":0},0]
[null,"1-Araştırma ve Geliştirme Giderleri(-) (630)",{"$f":"SUM(D20:F20)","v":0}]
[null,"2-Pazarlama, Satış ve Dağıtım Giderleri(-) (631)",{"$f":"SUM(D21:F21)","v":0}]
[null,"3-Genel Yönetim Giderleri(-) (632)",{"$f":"SUM(D22:F22)","v":0}]
[null,"MÜŞTEREK GENEL GİDERLER (DAĞITIM-HASILAT PAYINA GÖRE)",null,{"$f":"C23*D2","v":0},{"$f":"C23*E2","v":0},{"$f":"C23*F2","v":0}]
[null,"MÜŞTEREK GENEL GİDER GİBİ DAĞITIMA TABİ TUTULACAK AMORTİSMAN GİDERLERİ  (DAĞITIM-HASILAT PAYINA GÖRE)",null,{"$f":"C24*D2","v":0},{"$f":"C24*E2","v":0},{"$f":"C24*F2","v":0}]
[null,"FAALİYET KARI / ZARARI ",{"$f":"C18-C19","v":1000000},{"$f":"D18-D19","v":600000},{"$f":"E18-E19","v":400000},0]
[null,"F-DİĞER FAALİYETLERDEN OLAĞAN GELİR VE KARLAR (64)",{"$f":"SUM(C27:C35)","v":0},{"$f":"SUM(D27:D35)","v":0},{"$f":"SUM(E27:E35)","v":0},{"$f":"SUM(F27:F35)","v":0}]
[null,"         1- İŞTİRAKLERDEN TEMETTÜ GELİRLERİ (640)",{"$f":"SUM(D27:F27)","v":0}]
[null,"         2- BAĞLI ORTAKLIKLARDAN TEMETTÜ GELİRLERİ (641)",{"$f":"SUM(D28:F28)","v":0}]
[null,"         3- FAİZ GELİRLERİ (642) (ihracat ve imalat kaynaklı alacağın tahsiline kadar olan süreçte oluşan)",0]
[null,"         4- KOMİSYON GELİRLERİ (643)",0]
[null,"         5- KONUSU OLMAYAN KARŞILIKLAR (644)",0]
[null,"         6- MENKUL KIYMET SATIŞ KARLARI (645)",0]
[null,"         7- KAMBİYO KARLARI (646) (ihracat ve imalat kaynaklı alacağın tahsiline kadar olan süreçte oluşan)",0]
[null,"         8- REESKONT FAİZ GELİRLERİ (647)",0]
[null,"         9- FAALİYETLE İLGİLİ DİĞER GELİR VE KARLAR (649)",0]
[null,"ARA TOPLAM",{"$f":"C25+C26","v":1000000},{"$f":"D25+D26","v":600000},{"$f":"E25+E26","v":400000},{"$f":"F25+F26","v":0}]
[null,"G-DİĞER FAALİYETLERDEN OLAĞAN GİDER VE ZARARLAR(-) (65)",{"$f":"SUM(C38:C43)","v":0},{"$f":"SUM(D38:D43)","v":0},{"$f":"SUM(E38:E43)","v":0},0]
[null,"         1- KOMİSYON GİDERLERİ (653)",{"$f":"SUM(D38:F38)","v":0}]
[null,"         2- KARŞILIK GİDERLERİ (654)",{"$f":"SUM(D39:F39)","v":0}]
[null,"         3- MENKUL KIYMET SATIŞ ZARARLARI (655)",0]
[null,"         4- KAMBİYO ZARARLARI (656) (ihracat ve imalat kaynaklı alacağın tahsiline kadar olan süreçte oluşan)",0]
[null,"         5- REESKONT FAİZ GİDERLERİ (657)",0]
[null,"         6- DİĞER OLAĞAN GİDER VE ZARARLAR (659)",{"$f":"SUM(D43:F43)","v":0}]
[null,"ARA TOPLAM",{"$f":"C36-C37","v":1000000},{"$f":"D36-D37","v":600000},{"$f":"E36-E37","v":400000},0]
[null,"H-FİNANSMAN GİDERLERİ(-) (66)",{"$f":"SUM(C46:C49)","v":0},{"$f":"SUM(D46:D49)","v":0},{"$f":"SUM(E46:E49)","v":0},{"$f":"SUM(F46:F49)","v":0}]
[null,"         1- KISA VADELİ BORÇLANMA GİDERLERİ (-)",{"$f":"SUM(D46:F46)","v":0}]
[null,"         2- UZUN VADELİ BORÇLANMA GİDERLERİ (-)",{"$f":"SUM(D47:F47)","v":0}]
[null,"         1- KISA VADELİ BORÇLANMA GİDERLERİ (-) (DAĞITIM)",null,{"$f":"C48*D2","v":0},{"$f":"C48*E2","v":0},{"$f":"C48*F2","v":0}]
[null,"         2- UZUN VADELİ BORÇLANMA GİDERLERİ (-) (DAĞITIM)",null,{"$f":"C49*D2","v":0},{"$f":"C49*E2","v":0},{"$f":"C49*F2","v":0}]
[null,"ARA TOPLAM",{"$f":"C44-C45","v":1000000},{"$f":"D44-D45","v":600000},{"$f":"E44-E45","v":400000},{"$f":"F44-F45","v":0}]
[null,"I-OLAĞANDIŞI GELİR VE KÂRLAR (67)",{"$f":"SUM(D51:F51)","v":0},{"$f":"SUM(D52:D53)","v":0},{"$f":"SUM(E52:E53)","v":0},{"$f":"SUM(F52:F53)","v":0}]
[null,"1- ÖNCEKİ DÖNEM GELİR VE KARLARI (671)",{"$f":"SUM(D52:F52)","v":0}]
[null,"2-DİĞER OLAĞAN DIŞI GELİR VE KARLAR (679)",{"$f":"SUM(D53:F53)","v":0}]
[null,"ARA TOPLAM",{"$f":"SUM(D54:F54)","v":1000000},{"$f":"D50+D51","v":600000},{"$f":"E50+E51","v":400000},0]
[null,"J-OLAĞANDIŞI GİDER VE ZARARLAR(-) (68)",{"$f":"SUM(C56:C58)","v":0},{"$f":"SUM(D56:D58)","v":0},{"$f":"SUM(E56:E58)","v":0},0]
[null,"1-Çalışmayan Kısım Gider ve Zararları(-) (680)",{"$f":"SUM(D56:F56)","v":0}]
[null,"2-Önceki Dönem Gider ve Zararları(-) (681)",{"$f":"SUM(D57:F57)","v":0}]
[null,"3-Diğer Olağan Dışı Gider ve Zararlar(-) (689)",0]
[null,"DÖNEM KÂRI VEYA ZARARI \n(TİCARİ BİLANÇO KARI ZARARI )",{"$f":"C54-C55","v":1000000},{"$f":"D54-D55","v":600000},{"$f":"E54-E55","v":400000},0]
[null,"İHRACAT, İMALAT VE DİĞER FAALİYETLERDEN ELDE EDİLEN KAZANCIN TOPLAM TİCARİ KAZANÇ İÇİNDEKİ PAYLARI  \n\n(Kazançlar arasında Öncelik İhracat Kazancına Verilmiştir. İhrcat Kazancından arta kalan Ticari Kazanç İmalat ve Diğer Faaliyetlere Sayılmıştır.)\n\n",null,{"$f":"IF(D59>=$C$59,1,\n    IF(D59<=0,0,\n    IF(AND(D59>0,D59<$C$59),D59/$C$59)))","v":0.6},{"$f":"IF(E59>=$C$59,1,\n    IF(E59<=0,0,\n    IF(AND(E59>0,E59<$C$59),E59/$C$59)))","v":0.4},{"$f":"IF(F59>=$C$59,1,\n    IF(F59<=0,0,\n    IF(AND(F59>0,F59<$C$59),F59/$C$59)))","v":0}]
[null,null,null,{"$f":"D60/(D60+E60+F60)","v":0.6},{"$f":"E60/(D60+E60+F60)","v":0.4},{"$f":"F60/(D60+E60+F60)","v":0}]
[]
[null,"KKEG +"]
[null," KABUL EDİLMEYEN GELİRLER -"]
[null,"ZARAR OLSA DAHİ İNDİRİLECEK İSTİSNALAR -",{"$f":"C66+C67+C68","v":0}]
[null,"Hizmet İhracatı Faaliyetinden (KVK 10-1/ğ) Elde Edilen Kazançlardan İstisna Edilenlerin Toplamı"]
[null,"İmalat Faaliyetinden Elde Edilen Kazançlardan İstisna Edilenlerin Toplamı"]
[null,"Diğer Faaliyetlerden Elde Edilen Kazançlardan İstisna Edilenlerin Toplamı"]
[null,"GEÇMİŞ YIL ZARARLARI -"]
[null,"İNDİRİMLER -",null,"AZAMİ YAZILABİLECEK İNDİRİMLER TUTARI",{"$f":"C59+C63-C64-C65-C69","v":1000000}]
[]
[null,"1 PUAN İNDİRİM UYGULANACAK TUTARIN HESABINDA İSTİSNA KAZANÇLAR DÜŞÜLDÜKTEN SONRA BULUNAN TİCARİ KAZANÇ TUTARI İLE  İHRACAT,İMALAT VE DİĞER KAZANÇLARIN TUTARI","TİCARİ KAZANÇ TAN İhracat ve İmalat Kazancından İstisna Olan Tutarlar Düşüldükten Sonra Kalan Tutarı","İhracat Faaliyetinden Elde Edilen  Kazançtan İstisna Olan Kısım Düşüldükten Sonra Bulunan Tutarı","Üretim  Faaliyetinden Elde Edilen  Kazançtan İstisna Olan Kısım Düşüldükten Sonra Bulunan Tutarı","Diğer Faaliyetinden Elde Edilen  Kazanç"]
[null,null,{"$f":"IF(C59-C66-C67<=0,0,C59-C66-C67)","v":1000000},{"$f":"IF($D$59-C66<=0,0,MIN($D$59-C66,$C$73*D61))","v":600000},{"$f":"IF($E$59-C67<=0,0,MIN($E$59-C67,$C$73*E61))","v":400000},{"$f":"IF(C73-D73-E73<=0,0,C73-D73-E73)","v":0}]
[null,"MATRAH DAĞITIM PAYLARI",null,{"$f":"IFERROR(IF(D73/C73<=0,0,D73/C73),0)","v":0.6},{"$f":"IFERROR(IF(E73/C73<=0,0,E73/C73),0)","v":0.4},{"$f":"IFERROR(F73/C73,0)","v":0}]
[null,"İHRACAT, İMALAT VE DİĞER FAALİYETLERDEN ELDE EDİLEN KAZANCIN TOPLAM TİCARİ KAZANÇ İÇİNDEKİ PAYLARI ",null,{"$f":"IFERROR(IF(AND(D73+E73>C73, F73<=0),1,(D73+E73)/C73),0)","v":1},null,{"$f":"IFERROR(IF(F73<=0,0,F73/C73),0)","v":0}]
[null,"NEGATİF VE % 100 DEN BÜYÜKLÜK KONTROLÜ SONRASINDAKİ PAYLARI",null,{"$f":"IFERROR(IF(D75<=0,0,IF(D75>1,1,D75)),0)","v":1},null,{"$f":"IFERROR(IF(F75<=0,0,IF(F75>1,1,F75)),0)","v":0}]
[]
[null,"SAFİ KURUM KAZANCI \n(KURUMLAR VERGİSİ MATRAHI)",{"$f":"C59+C63-C64-C65-C69-C70","v":1000000},{"$f":"IF(C78<0, \"ZARAR\",\"KAR\")","v":"KAR"}]
[]
[null,"2022 YILI 3. DÖNEM İNDİRİMLİ KURUMLAR VERGİSİ HESAPLAMA TABLOSU"]
[null,null,"1. TEŞVİK BELGESİ","2. TEŞVİK BELGESİ","3. TEŞVİK BELGESİ","4. TEŞVİK BELGESİ","5. TEŞVİK BELGESİ"]
[null,"Vergi İndirim Oranı (VİO)"]
[null,"KV MATRAHI (Safi Kurum Kazancı)",{"$f":"C78","v":1000000}]
[null,"32/A  Uygulanacak K.V. Matrahı (HER BİR TEŞVİK BELGESİ KAPSAMINDA YARARLANILABİLECEK YATIRIMA KATKI TUTARININ MATRAHI BU HÜCRELERE YAZILMALIDIR)",null,null,null,null,null,{"$f":"IF(SUM(C84:G84)>C78,\"32/A İNDİRİMİ UYGULANACAK KAZANÇ, SAFİ KURUM KAZANCINDAN FAZLADIR\",SUM(C84:G84))","v":0}]
[null,"32/A UYGULANMAYACAK K.V.  Matrahı",{"$f":"IF(C83-(C84+D84+E84+F84+G84)<0,0,C83-(C84+D84+E84+F84+G84))","v":1000000}]
[null,"MATRAH TOPLAMI",{"$f":"IF((C84+D84+E84+F84+G84+C85)>C78,C78,(C84+D84+E84+F84+G84+C85))","v":1000000}]
[]
[null,"SAFİ KURUM KAZANCININ  KV VERGİ ORANLARI İTİBARİYLE DAĞILIMI ","TOPLAM SAFİ KAZANÇ","İhracat Kazancı Payı","Üretim Kazancı Payı","Diğer Faaliyet Kazancı Payı"]
[]
[null,null,{"$f":"C78","v":1000000},{"$f":"IF(AND(AND($D$59>0,($D$59+$E$59)>=$C$59,D59>=C66),$C$90>=MAX(D59,D73)),\n\nMIN(MAX(IF(D59<=C90,D59,IF(D73<=C90,D73)),$C$90*D74)),\n\nIF(OR(D59<=0,D73<=0),0,\n\nMIN( MAX(   MAX(   IF(D59<=C90,D59),  IF(D73<=C90,D73) ),    MIN($C$90*D74,D59,D73)),$C$90)))","v":600000},{"$f":"MIN( IF(AND(AND($E$59>0,($D$59+$E$59)>=$C$59,E59>=C67),$C$90>=MAX(E59,E73)),\n\nMIN(MAX(IF(E59<=C90,E59,IF(E73<=C90,E73)),$C$90*E74)),\n\nIF(OR(E59<=0,E73<=0),0,\n\nMIN( MAX(   MAX(   IF(E59<=C90,E59),  IF(E73<=C90,E73) ),    MIN($C$90*E74,E59,E73)),$C$90))),C90-D90)","v":400000},{"$f":"C90-D90-E90","v":0}]
[null,"SAFİ KURUM KAZANCININ DAĞILIMI ORANSAL DAĞILIMI",{"$f":"C90","v":1000000},{"$f":"D90/C90","v":0.6},{"$f":"E90/C90","v":0.4},{"$f":"F90/C90","v":0}]
[null,"SAFİ KURUM KAZANCININ DAĞILIMI TUTARSAL",{"$f":"C91","v":1000000},{"$f":"D90","v":600000},{"$f":"E90","v":400000},{"$f":"F90","v":0}]
[null,"SAFİ KURUM KAZANCI DAĞILIMI",{"$f":"C92","v":1000000},{"$f":"IFERROR(IF(D92/C92>=1,1,D92/C92),0)","v":0.6},{"$f":"IFERROR(IF(E92/C92>=1,1,E92/C92),0)","v":0.4},{"$f":"IFERROR(IF(F92/C92>=1,1,F92/C92),0)","v":0},null,"KV ORANI"]
[null,"1 PUAN VE 32/A İNDİRİMİ OLMASAYDI HESAPLANAN KV TUTARI",{"$f":"C93*$H$94","v":250000},{"$f":"D92*$H$94","v":150000},{"$f":"E92*$H$94","v":100000},{"$f":"F92*$H$94","v":0},null,0.25]
[null,"32/ A UYGULANAN MATRAH",{"$f":"C84+D84+E84+F84+G84","v":0},{"$f":"D107+D112+D117+D122+D127","v":0},{"$f":"D106+D111+D116+D121+D126","v":0},{"$f":"D105+D110+D115+D120+D125","v":0}]
[null,"32/A UYGULANACAK MATRAH ÜZERİNDEN ÖDENECEK KV TUTARI",{"$f":"J108+J113+J118+J123+J128","v":0},{"$f":"J107+J112+J117+J122+J127","v":0},{"$f":"J106+J111+J116+J121+J126","v":0},{"$f":"J105+J110+J115+J120+J125","v":0}]
[null,"32/A UYGULANMAYAN MATRAH",{"$f":"IF(C85<=0,0,C85)","v":1000000},{"$f":"D132","v":600000},{"$f":"D131","v":400000},{"$f":"D130","v":0}]
[null,"32/A UYGULANMAYAN MATRAH ÜZERİNDEN ÖDENECEK KV TUTARI",{"$f":"L130","v":216000},{"$f":"J132","v":120000},{"$f":"J131","v":96000},{"$f":"J130","v":0}]
[null,"TOPLAM ÖDENECEK KV",{"$f":"C96+C98","v":216000},{"$f":"J132+J107","v":120000},{"$f":"J131+J106","v":96000},{"$f":"J130+J105","v":0}]
[null,"TOPLAM AVANTAJ  (YARARLANILAN 1 PUAN İNDİRİMİ + 32/A İNDİRİMİ TUTARI )",{"$f":"C94-C99","v":34000},{"$f":"D101+D102","v":30000},{"$f":"E101+E102","v":4000},{"$f":"F101+F102","v":0}]
[null,"YARARLANILAN 1 - 5 PUAN İNDİRİMİ TUTARI",{"$f":"F133+F128+F123+F118+F113+F108","v":34000},{"$f":"F132+F107+F112+F117+F122+F127","v":30000},{"$f":"F131+F106+F111+F116+F121+F126","v":4000},{"$f":"F130+F105+F110+F115+F120+F125","v":0}]
[null,"YARLANILAN 32/A İNDİRİMİ TUTARI",{"$f":"K108+K113+K118+K123+K128+K133","v":0},{"$f":"K107+K112+K122+K127+K132","v":0},{"$f":"K106+K111+K116+K121+K126+K131","v":0},{"$f":"K105++K110+K115+K120+K125+K130","v":0}]
[]
[null,"32/A UYGULANABİLECEK MATRAH (1.TEŞVİK BELGESİ)",{"$f":"C84","v":0},"KV MATRAHI","1 - 5 PUAN İNDİRİM OLMASAYDI HESAPLANAN KV TUTARI","1 -5 Puan İndirim Tutarı","1 - 5 Puan İndirim Sonrasında Hesaplanan KV Tutarı","32/A İndirimi Olmasaydı Ödenecek KV Tutarı","1 -5 Puan İndirim ve 32/A VİO Uygulandıktan Sonra Tatbik Edilecek KV Oranı","1 -5 Puan İndirim ve 32/A İndirimi Uygulandıktan Sonra Ödenecek  KV Tutarı","Yararlanılan Yatırıma Katkı Tutarı\n(32/A İnd. KV Nedeniyle Vazgeçilen Vergi Tutarı)","Ödenecek KV Tutarı"]
[null,"GENEL ORANA TABİ KISIM (DİĞER FAALİYETLER)",{"$f":"F93","v":0},{"$f":"C104*C105","v":0},{"$f":"D105*$H$94","v":0},0,{"$f":"E105-F105","v":0},{"$f":"G105","v":0},{"$f":"($H$94)-(($H$94)*$C$82)","v":0.25},{"$f":"I105*D105","v":0},{"$f":"G105-J105","v":0},{"$f":"J108","v":0}]
[null,"1 PUAN İNDİRİMLİ ORANA TABİ KISIM  (İMALAT)",{"$f":"E93","v":0.4},{"$f":"C104*C106","v":0},{"$f":"D106*$H$94","v":0},{"$f":"D106/100","v":0},{"$f":"E106-F106","v":0},{"$f":"G106","v":0},{"$f":"($H$94-0.01)-(($H$94-0.01)*$C$82)","v":0.24},{"$f":"I106*D106","v":0},{"$f":"G106-J106","v":0}]
[null,"5 PUAN İNDİRİMLİ ORANA TABİ KISIM  ( İHRACAT)",{"$f":"D93","v":0.6},{"$f":"C104*C107","v":0},{"$f":"D107*$H$94","v":0},{"$f":"D107/20","v":0},{"$f":"E107-F107","v":0},0,{"$f":"($H$94-0.05)-(($H$94-0.05)*C82)","v":0.2},0,{"$f":"G107-J107","v":0}]
[null,"TOPLAM",{"$f":"SUM(C105:C107)","v":1},{"$f":"SUM(D105:D107)","v":0},0,{"$f":"SUM(F105:F107)","v":0},{"$f":"SUM(G105:G107)","v":0},{"$f":"SUM(H105:H107)","v":0},null,0,0]
[null,"32/A UYGULANABİLECEK MATRAH (2.TEŞVİK BELGESİ)",{"$f":"D84","v":0},"KV MATRAHI","1 - 5 PUAN İNDİRİM OLMASAYDI HESAPLANAN KV TUTARI","1 -5 Puan İndirim Tutarı","1 -5 Puan İndirim Sonrasında Hesaplanan KV Tutarı","32/A İndirimi Olmasaydı Ödenecek KV Tutarı","1 - 5 Puan İndirim ve 32/A VİO Uygulandıktan Sonra Tatbik Edilecek KV Oranı","1-5  Puan İndirim ve 32/A İndirimi Uygulandıktan Sonra Ödenecek  KV Tutarı","Yararlanılan Yatırıma Katkı Tutarı\n(32/A İnd. KV Nedeniyle Vazgeçilen Vergi Tutarı)","Ödenecek KV Tutarı"]
[null,"GENEL ORANA TABİ KISIM (DİĞER FAALİYETLER)",{"$f":"F93","v":0},{"$f":"C109*C110","v":0},{"$f":"D110*$H$94","v":0},0,{"$f":"E110-F110","v":0},{"$f":"G110","v":0},{"$f":"($H$94)-(($H$94)*D82)","v":0.25},{"$f":"I110*D110","v":0},{"$f":"G110-J110","v":0},{"$f":"J113","v":0}]
[null,"1 PUAN İNDİRİMLİ ORANA TABİ KISIM  (İMALAT)",{"$f":"E93","v":0.4},{"$f":"C109*C111","v":0},{"$f":"D111*$H$94","v":0},{"$f":"D111/100","v":0},{"$f":"E111-F111","v":0},{"$f":"G111","v":0},{"$f":"($H$94-0.01)-(($H$94-0.01)*D82)","v":0.24},{"$f":"I111*D111","v":0},{"$f":"G111-J111","v":0}]
[null,"5 PUAN İNDİRİMLİ ORANA TABİ KISIM  ( İHRACAT)",{"$f":"D93","v":0.6},{"$f":"C109*C112","v":0},{"$f":"D112*$H$94","v":0},{"$f":"D112/20","v":0},{"$f":"E112-F112","v":0},0,{"$f":"($H$94-0.05)-(($H$94-0.05)*D82)","v":0.2},0,{"$f":"G112-J112","v":0}]
[null,"TOPLAM",{"$f":"SUM(C110:C112)","v":1},0,0,{"$f":"SUM(F110:F112)","v":0},{"$f":"SUM(G110:G112)","v":0},{"$f":"SUM(H110:H112)","v":0},null,{"$f":"SUM(J110:J112)","v":0},0]
[null,"32/A UYGULANABİLECEK MATRAH (3.TEŞVİK BELGESİ)",{"$f":"E84","v":0},"KV MATRAHI","1 - 5 PUAN İNDİRİM OLMASAYDI HESAPLANAN KV TUTARI","1-5 Puan İndirim Tutarı","1 - 5 Puan İndirim Sonrasında Hesaplanan KV Tutarı","32/A İndirimi Olmasaydı Ödenecek KV Tutarı","1 - 5 Puan İndirim ve 32/A VİO Uygulandıktan Sonra Tatbik Edilecek KV Oranı","1 -5 Puan İndirim ve 32/A İndirimi Uygulandıktan Sonra Ödenecek  KV Tutarı","Yararlanılan Yatırıma Katkı Tutarı\n(32/A İnd. KV Nedeniyle Vazgeçilen Vergi Tutarı)","Ödenecek KV Tutarı"]
[null,"GENEL ORANA TABİ KISIM (DİĞER FAALİYETLER)",{"$f":"F93","v":0},{"$f":"C114*C115","v":0},{"$f":"D115*$H$94","v":0},0,{"$f":"E115-F115","v":0},{"$f":"G115","v":0},{"$f":"($H$94)-(($H$94)*E82)","v":0.25},{"$f":"I115*D115","v":0},{"$f":"G115-J115","v":0},{"$f":"J118","v":0}]
[null,"1 PUAN İNDİRİMLİ ORANA TABİ KISIM  (İMALAT)",{"$f":"E93","v":0.4},{"$f":"C114*C116","v":0},{"$f":"D116*$H$94","v":0},{"$f":"D116/100","v":0},{"$f":"E116-F116","v":0},{"$f":"G116","v":0},{"$f":"($H$94-0.01)-(($H$94-0.01)*E82)","v":0.24},{"$f":"I116*D116","v":0},{"$f":"G116-J116","v":0}]
[null,"5 PUAN İNDİRİMLİ ORANA TABİ KISIM  ( İHRACAT)",{"$f":"D93","v":0.6},{"$f":"C114*C117","v":0},{"$f":"D117*$H$94","v":0},{"$f":"D117/20","v":0},{"$f":"E117-F117","v":0},0,{"$f":"($H$94-0.05)-(($H$94-0.05)*E82)","v":0.2},0,{"$f":"G117-J117","v":0}]
[null,"TOPLAM",{"$f":"SUM(C115:C117)","v":1},0,0,{"$f":"SUM(F115:F117)","v":0},{"$f":"SUM(G115:G117)","v":0},{"$f":"SUM(H115:H117)","v":0},null,{"$f":"SUM(J115:J117)","v":0},0]
[null,"32/A UYGULANABİLECEK MATRAH (4. TEŞVİK BELGESİ)",{"$f":"F84","v":0},"KV MATRAHI","1 - 5 PUAN İNDİRİM OLMASAYDI HESAPLANAN KV TUTARI","1-5 Puan İndirim Tutarı","1 -5 Puan İndirim Sonrasında Hesaplanan KV Tutarı","32/A İndirimi Olmasaydı Ödenecek KV Tutarı","1- 5  Puan İndirim ve 32/A VİO Uygulandıktan Sonra Tatbik Edilecek KV Oranı","1-5 Puan İndirim ve 32/A İndirimi Uygulandıktan Sonra Ödenecek  KV Tutarı","Yararlanılan Yatırıma Katkı Tutarı\n(32/A İnd. KV Nedeniyle Vazgeçilen Vergi Tutarı)","Ödenecek KV Tutarı"]
[null,"GENEL ORANA TABİ KISIM (DİĞER FAALİYETLER)",{"$f":"F93","v":0},{"$f":"C119*C120","v":0},{"$f":"D120*$H$94","v":0},0,{"$f":"E120-F120","v":0},{"$f":"G120","v":0},{"$f":"($H$94)-(($H$94)*F82)","v":0.25},{"$f":"I120*D120","v":0},{"$f":"G120-J120","v":0},{"$f":"J123","v":0}]
[null,"1 PUAN İNDİRİMLİ ORANA TABİ KISIM  (İMALAT)",{"$f":"E93","v":0.4},{"$f":"C119*C121","v":0},{"$f":"D121*$H$94","v":0},{"$f":"D121/100","v":0},{"$f":"E121-F121","v":0},{"$f":"G121","v":0},{"$f":"($H$94-0.01)-(($H$94-0.01)*F82)","v":0.24},{"$f":"I121*D121","v":0},{"$f":"G121-J121","v":0}]
[null,"5 PUAN İNDİRİMLİ ORANA TABİ KISIM  ( İHRACAT)",{"$f":"D93","v":0.6},{"$f":"C119*C122","v":0},{"$f":"D122*$H$94","v":0},{"$f":"D122/20","v":0},{"$f":"E122-F122","v":0},0,{"$f":"($H$94-0.05)-(($H$94-0.05)*F82)","v":0.2},0,{"$f":"G122-J122","v":0}]
[null,"TOPLAM",{"$f":"SUM(C120:C122)","v":1},0,0,{"$f":"SUM(F120:F122)","v":0},{"$f":"SUM(G120:G122)","v":0},{"$f":"SUM(H120:H122)","v":0},null,{"$f":"SUM(J120:J122)","v":0},0]
[null,"32/A UYGULANABİLECEK MATRAH (5.TEŞVİK BELGESİ)",{"$f":"G84","v":0},"KV MATRAHI","1 - 5 PUAN İNDİRİM OLMASAYDI HESAPLANAN KV TUTARI","1-5 Puan İndirim Tutarı","1 - 5 Puan İndirim Sonrasında Hesaplanan KV Tutarı","32/A İndirimi Olmasaydı Ödenecek KV Tutarı","1 -5 Puan İndirim ve 32/A VİO Uygulandıktan Sonra Tatbik Edilecek KV Oranı","1 - 5 Puan İndirim ve 32/A İndirimi Uygulandıktan Sonra Ödenecek  KV Tutarı","Yararlanılan Yatırıma Katkı Tutarı\n(32/A İnd. KV Nedeniyle Vazgeçilen Vergi Tutarı)","Ödenecek KV Tutarı"]
[null,"GENEL ORANA TABİ KISIM (DİĞER FAALİYETLER)",{"$f":"F93","v":0},{"$f":"C124*C125","v":0},{"$f":"D125*$H$94","v":0},0,{"$f":"E125-F125","v":0},{"$f":"G125","v":0},{"$f":"($H$94)-(($H$94)*G82)","v":0.25},{"$f":"I125*D125","v":0},{"$f":"G125-J125","v":0},{"$f":"J128","v":0}]
[null,"1 PUAN İNDİRİMLİ ORANA TABİ KISIM  (İMALAT)",{"$f":"E93","v":0.4},{"$f":"C124*C126","v":0},{"$f":"D126*$H$94","v":0},{"$f":"D126/100","v":0},{"$f":"E126-F126","v":0},{"$f":"G126","v":0},{"$f":"($H$94-0.01)-(($H$94-0.01)*G82)","v":0.24},{"$f":"I126*D126","v":0},{"$f":"G126-J126","v":0}]
[null,"5 PUAN İNDİRİMLİ ORANA TABİ KISIM  ( İHRACAT)",{"$f":"D93","v":0.6},{"$f":"C124*C127","v":0},{"$f":"D127*$H$94","v":0},{"$f":"D127/20","v":0},{"$f":"E127-F127","v":0},0,{"$f":"($H$94-0.05)-(($H$94-0.05)*G82)","v":0.2},0,{"$f":"G127-J127","v":0}]
[null,"TOPLAM",{"$f":"SUM(C125:C127)","v":1},0,0,{"$f":"SUM(F125:F127)","v":0},{"$f":"SUM(G125:G127)","v":0},{"$f":"SUM(H125:H127)","v":0},null,{"$f":"SUM(J125:J127)","v":0},0]
[null,"32/A UYGULANAMAYACAK MATRAH",{"$f":"IF(C85<=0,0,C85)","v":1000000},"KV MATRAHI","1-5 PUAN İNDİRİM OLMASAYDI HESAPLANAN KV TUTARI","1-5 Puan İndirim Tutarı","1 -5 Puan İndirim Sonrasında Hesaplanan KV Tutarı","32/A İNDİRİMİ UYGULANMAZ",null,"1 Puan İndirim ve 32/A İndirimi Uygulandıktan Sonra Ödenecek  KV Tutarı","Yararlanılan Yatırıma Katkı Tutarı\n(32/A İnd. KV Nedeniyle Vazgeçilen Vergi Tutarı)","Ödenecek KV Tutarı"]
[null,"GENEL ORANA TABİ KISIM (DİĞER FAALİYETLER)",{"$f":"F93","v":0},{"$f":"C129*C130","v":0},{"$f":"D130*$H$94","v":0},0,{"$f":"E130-F130","v":0},null,null,{"$f":"G130","v":0},{"$f":"G130-J130","v":0},{"$f":"J133","v":216000}]
[null,"1 PUAN İNDİRİMLİ ORANA TABİ KISIM  (İMALAT)",{"$f":"E93","v":0.4},{"$f":"C131*C129","v":400000},{"$f":"D131*$H$94","v":100000},{"$f":"D131/100","v":4000},{"$f":"E131-F131","v":96000},null,null,{"$f":"G131","v":96000},{"$f":"G131-J131","v":0}]
[null,"5 PUAN İNDİRİMLİ ORANA TABİ KISIM  ( İHRACAT)",{"$f":"D93","v":0.6},{"$f":"C132*C129","v":600000},{"$f":"D132*$H$94","v":150000},{"$f":"D132/20","v":30000},{"$f":"E132-F132","v":120000},null,null,120000,0]
[null,"TOPLAM",{"$f":"SUM(C130:C132)","v":1},{"$f":"SUM(D130:D132)","v":1000000},250000,{"$f":"SUM(F130:F132)","v":34000},{"$f":"SUM(G130:G132)","v":216000},null,null,216000,0]
[null,"TOPLAM KV MATRAHI VE ÖDENMESİ GEREKEN KV ",{"$f":"C104+C129+C109+C114+C119+C124","v":1000000},{"$f":"D108+D133+D113+D118+D123+D128","v":1000000},{"$f":"E108+E133+E113+E118+E123+E128","v":250000},{"$f":"F108+F133+F113+F118+F123+F128","v":34000},{"$f":"G108+G133+G113+G118+G123+G128","v":216000},null,null,{"$f":"J108+J133+J113+J118+J123+J128","v":216000},{"$f":"K133+K108+K113+K118+K123+K128","v":0},{"$f":"L105+L130+L110+L115+L120+L125","v":216000}]
[]
[null,"GEÇİCİ VERGİ BEYANNMESİNDE MATRAH BİLDİRİMİ BÖLÜMÜNDE DOLDURULACAK KISIMLAR VE TUTARLARI"]
[null,"32 A Madde Kapsamında İndirimli Kurumlar Vergisine (Geçici Vergiye) Tabi Matrah",{"$f":"C104+C109+C114+C119+C124","v":0},{"$f":"E108+E113+E118+E123+E128","v":0},"1-5 Puan Olmasaydı Hesaplan KV Tutarı"]
[null,null,null,{"$f":"G108+G113+G118+G123++G128","v":0},"1 -5 Puan İndirim Sonrasında Ödenecek KV Tutarı\n (32 A olmasaydı hesaplanacak Vergi)"]
[null,null,null,{"$f":"K108+K113+K118+K123+K128","v":0},"32/A İndirimi ile Vazgeçilen Vergi"]
[null,"32 A Madde Kapsamında İndirimli Kurumlar Vergisi(Geçici Vergi) Oranı",{"$f":"IFERROR(D140/C137,0)","v":0},{"$f":"L105+L110+L115+L120+L125","v":0},"32/A ya Tabi Matrah Üzerinden Ödenecek KV"]
[null,"32/7 Madde Kapsamında İndirimli Kurumlar Vergisine (Geçici Vergiye) Tabi Matrah  (İhracat)",{"$f":"D132","v":600000},{"$f":"E132","v":150000},"5 Puan Olmasaydı Hesaplan KV Tutarı"]
[null,null,null,{"$f":"F132","v":30000},"5 Puan İndirimin Vergi Etkisi "]
[null,"32/7 Madde Kapsamında İndirimli Kurumlar Vergisi (Geçici Vergi) Oranı",{"$f":"IFERROR(D143/C141,0)","v":0.2},{"$f":"G132","v":120000},"5 Puan İndirim Sonrasında Ödenecek KV Tutarı (İhracat)\n"]
[null,"32/8 Madde Kapsamında İndirimli Kurumlar Vergisine (Geçici Vergiye) Tabi Matrah  (Üretim)",{"$f":"D131","v":400000},{"$f":"E131","v":100000},"1 Puan Olmasaydı Hesaplan KV Tutarı"]
[null,null,null,{"$f":"F131","v":4000},"1 Puan İndirimin Vergi Etkisi "]
[null,"32/8 Madde Kapsamında İndirimli Kurumlar Vergisi (Geçici Vergi) Oranı",{"$f":"IFERROR(D146/C144,0)","v":0.24},{"$f":"G131","v":96000},"1 Puan İndirim Sonrasında Ödenecek KV Tutarı (Üretim)\n"]
[null,"Genel Orana Tabi Matrah (Diğer)",{"$f":"D130","v":0},{"$f":"J130","v":0},"Diğer Faalilyetlerden Elde Edilen Kazanç"]
[null,null,{"$f":"IFERROR(D147/C147,0)","v":0}]
[null,"MATRAHLAR TOPLAMI",{"$f":"C137+C144+C141+C147","v":1000000},{"$f":"D140+D146+D143+D147","v":216000}]

{"sheet":"İÜ Ö2","index":10,"n_rows":149,"n_cols":12,"rows_kept":149,"cut":false,"hidden":true,"merged":[[128,7,133,8],[129,11,132,11],[1,1,2,1],[59,1,59,2],[60,1,60,2],[82,2,82,6],[109,11,112,11],[114,11,117,11],[119,11,122,11],[124,11,127,11],[84,2,84,6],[85,2,85,6],[87,5,88,5],[104,11,107,11],[135,1,135,4],[137,1,138,2],[71,1,72,1],[73,1,73,2],[74,1,74,2],[74,3,74,4],[75,1,75,2],[75,3,75,4],[79,1,79,3],[87,1,89,1],[87,2,88,2],[87,3,88,3],[87,4,88,4]]}
[]
[null,"FAALİYET TÜRLERİ İTİBARİYLE HASILATLAR VE TOPLAM İÇİNDEKİ ORANLARI",{"$f":"IFERROR(C4/C4,0)","v":1},{"$f":"IFERROR(D4/C4,0)","v":0.5},{"$f":"IFERROR(E4/C4,0)","v":0.3},{"$f":"IFERROR(F4/C4,0)","v":0.2}]
[null,null,"Toplam Hasılat","İhracat faaliyeti","İmalat faaliyeti","Diğer faaliyetler"]
[null,"A-BRÜT SATIŞLAR (60)",{"$f":"D4+E4+F4","v":3000000},{"$f":"SUM(D5:D7)","v":1500000},{"$f":"SUM(E5:E7)","v":900000},600000]
[null,"1-Yurtiçi Satışlar (600)",{"$f":"D5+E5+F5","v":1500000},null,900000,600000]
[null,"2-Yurtdışı Satışlar (601)",{"$f":"D6+E6+F6","v":1500000},1500000]
[null,"3-Diğer Gelirler (602)",{"$f":"D7+E7+F7","v":0}]
[null,"B-SATIŞ İNDİRİMLERİ(-) (61)",{"$f":"SUM(C9:C11)","v":0},{"$f":"SUM(D9:D11)","v":0},{"$f":"SUM(E9:E11)","v":0},0]
[null,"1-Satıştan İadeler (-) (610)",{"$f":"SUM(D9:F9)","v":0}]
[null,"2- Satış İskontoları (-) (611)",{"$f":"SUM(D10:F10)","v":0}]
[null,"3-Diğer İndirimler (-) (612)",0]
[null,"C-NET SATIŞLAR",{"$f":"C4-C8","v":3000000},{"$f":"D4-D8","v":1500000},{"$f":"E4-E8","v":900000},600000]
[null,"D-SATIŞLARIN MALİYETİ (-) (62)",{"$f":"SUM(C14:C17)","v":0},{"$f":"SUM(D14:D17)","v":0},{"$f":"SUM(E14:E17)","v":0},{"$f":"SUM(F14:F17)","v":0}]
[null,"1-Satılan Mamuller Maliyeti ( 620)",{"$f":"SUM(D14:F14)","v":0}]
[null,"2-Satılan Ticari Mal Maliyeti (621)",{"$f":"SUM(D15:F15)","v":0}]
[null,"3-Satılan Hizmet Maliyeti (622)",0]
[null,"4-Diğer Satışların Maliyeti (623)",{"$f":"SUM(D17:F17)","v":0}]
[null,"BRÜT SATIŞ KARI / ZARARI",{"$f":"C12-C13","v":3000000},{"$f":"D12-D13","v":1500000},{"$f":"E12-E13","v":900000},600000]
[null,"E-FAALİYET GİDERLERİ (-) (63)",{"$f":"SUM(C20:C24)","v":0},{"$f":"SUM(D20:D24)","v":0},{"$f":"SUM(E20:E24)","v":0},0]
[null,"1-Araştırma ve Geliştirme Giderleri(-) (630)",{"$f":"SUM(D20:F20)","v":0}]
[null,"2-Pazarlama, Satış ve Dağıtım Giderleri(-) (631)",{"$f":"SUM(D21:F21)","v":0}]
[null,"3-Genel Yönetim Giderleri(-) (632)",{"$f":"SUM(D22:F22)","v":0}]
[null,"MÜŞTEREK GENEL GİDERLER (DAĞITIM-HASILAT PAYINA GÖRE)",null,{"$f":"C23*D2","v":0},{"$f":"C23*E2","v":0},{"$f":"C23*F2","v":0}]
[null,"MÜŞTEREK GENEL GİDER GİBİ DAĞITIMA TABİ TUTULACAK AMORTİSMAN GİDERLERİ  (DAĞITIM-HASILAT PAYINA GÖRE)",null,{"$f":"C24*D2","v":0},{"$f":"C24*E2","v":0},{"$f":"C24*F2","v":0}]
[null,"FAALİYET KARI / ZARARI ",{"$f":"C18-C19","v":3000000},{"$f":"D18-D19","v":1500000},{"$f":"E18-E19","v":900000},600000]
[null,"F-DİĞER FAALİYETLERDEN OLAĞAN GELİR VE KARLAR (64)",{"$f":"SUM(C27:C35)","v":0},{"$f":"SUM(D27:D35)","v":0},{"$f":"SUM(E27:E35)","v":0},{"$f":"SUM(F27:F35)","v":0}]
[null,"         1- İŞTİRAKLERDEN TEMETTÜ GELİRLERİ (640)",{"$f":"SUM(D27:F27)","v":0}]
[null,"         2- BAĞLI ORTAKLIKLARDAN TEMETTÜ GELİRLERİ (641)",{"$f":"SUM(D28:F28)","v":0}]
[null,"         3- FAİZ GELİRLERİ (642) (ihracat ve imalat kaynaklı alacağın tahsiline kadar olan süreçte oluşan)",0]
[null,"         4- KOMİSYON GELİRLERİ (643)",0]
[null,"         5- KONUSU OLMAYAN KARŞILIKLAR (644)",0]
[null,"         6- MENKUL KIYMET SATIŞ KARLARI (645)",0]
[null,"         7- KAMBİYO KARLARI (646) (ihracat ve imalat kaynaklı alacağın tahsiline kadar olan süreçte oluşan)",0]
[null,"         8- REESKONT FAİZ GELİRLERİ (647)",0]
[null,"         9- FAALİYETLE İLGİLİ DİĞER GELİR VE KARLAR (649)",0]
[null,"ARA TOPLAM",{"$f":"C25+C26","v":3000000},{"$f":"D25+D26","v":1500000},{"$f":"E25+E26","v":900000},{"$f":"F25+F26","v":600000}]
[null,"G-DİĞER FAALİYETLERDEN OLAĞAN GİDER VE ZARARLAR(-) (65)",{"$f":"SUM(C38:C43)","v":0},{"$f":"SUM(D38:D43)","v":0},{"$f":"SUM(E38:E43)","v":0},0]
[null,"         1- KOMİSYON GİDERLERİ (653)",{"$f":"SUM(D38:F38)","v":0}]
[null,"         2- KARŞILIK GİDERLERİ (654)",{"$f":"SUM(D39:F39)","v":0}]
[null,"         3- MENKUL KIYMET SATIŞ ZARARLARI (655)",0]
[null,"         4- KAMBİYO ZARARLARI (656) (ihracat ve imalat kaynaklı alacağın tahsiline kadar olan süreçte oluşan)",0]
[null,"         5- REESKONT FAİZ GİDERLERİ (657)",0]
[null,"         6- DİĞER OLAĞAN GİDER VE ZARARLAR (659)",{"$f":"SUM(D43:F43)","v":0}]
[null,"ARA TOPLAM",{"$f":"C36-C37","v":3000000},{"$f":"D36-D37","v":1500000},{"$f":"E36-E37","v":900000},600000]
[null,"H-FİNANSMAN GİDERLERİ(-) (66)",{"$f":"SUM(C46:C49)","v":0},{"$f":"SUM(D46:D49)","v":0},{"$f":"SUM(E46:E49)","v":0},{"$f":"SUM(F46:F49)","v":0}]
[null,"         1- KISA VADELİ BORÇLANMA GİDERLERİ (-)",{"$f":"SUM(D46:F46)","v":0}]
[null,"         2- UZUN VADELİ BORÇLANMA GİDERLERİ (-)",{"$f":"SUM(D47:F47)","v":0}]
[null,"         1- KISA VADELİ BORÇLANMA GİDERLERİ (-) (DAĞITIM)",null,{"$f":"C48*D2","v":0},{"$f":"C48*E2","v":0},{"$f":"C48*F2","v":0}]
[null,"         2- UZUN VADELİ BORÇLANMA GİDERLERİ (-) (DAĞITIM)",null,{"$f":"C49*D2","v":0},{"$f":"C49*E2","v":0},{"$f":"C49*F2","v":0}]
[null,"ARA TOPLAM",{"$f":"C44-C45","v":3000000},{"$f":"D44-D45","v":1500000},{"$f":"E44-E45","v":900000},{"$f":"F44-F45","v":600000}]
[null,"I-OLAĞANDIŞI GELİR VE KÂRLAR (67)",{"$f":"SUM(D51:F51)","v":0},{"$f":"SUM(D52:D53)","v":0},{"$f":"SUM(E52:E53)","v":0},{"$f":"SUM(F52:F53)","v":0}]
[null,"1- ÖNCEKİ DÖNEM GELİR VE KARLARI (671)",{"$f":"SUM(D52:F52)","v":0}]
[null,"2-DİĞER OLAĞAN DIŞI GELİR VE KARLAR (679)",{"$f":"SUM(D53:F53)","v":0}]
[null,"ARA TOPLAM",{"$f":"SUM(D54:F54)","v":3000000},{"$f":"D50+D51","v":1500000},{"$f":"E50+E51","v":900000},600000]
[null,"J-OLAĞANDIŞI GİDER VE ZARARLAR(-) (68)",{"$f":"SUM(C56:C58)","v":0},{"$f":"SUM(D56:D58)","v":0},{"$f":"SUM(E56:E58)","v":0},0]
[null,"1-Çalışmayan Kısım Gider ve Zararları(-) (680)",{"$f":"SUM(D56:F56)","v":0}]
[null,"2-Önceki Dönem Gider ve Zararları(-) (681)",{"$f":"SUM(D57:F57)","v":0}]
[null,"3-Diğer Olağan Dışı Gider ve Zararlar(-) (689)",0]
[null,"DÖNEM KÂRI VEYA ZARARI \n(TİCARİ BİLANÇO KARI ZARARI )",{"$f":"C54-C55","v":3000000},{"$f":"D54-D55","v":1500000},{"$f":"E54-E55","v":900000},600000]
[null,"İHRACAT, İMALAT VE DİĞER FAALİYETLERDEN ELDE EDİLEN KAZANCIN TOPLAM TİCARİ KAZANÇ İÇİNDEKİ PAYLARI  \n\n(Kazançlar arasında Öncelik İhracat Kazancına Verilmiştir. İhrcat Kazancından arta kalan Ticari Kazanç İmalat ve Diğer Faaliyetlere Sayılmıştır.)\n\n",null,{"$f":"IF(D59>=$C$59,1,\n    IF(D59<=0,0,\n    IF(AND(D59>0,D59<$C$59),D59/$C$59)))","v":0.5},{"$f":"IF(E59>=$C$59,1,\n    IF(E59<=0,0,\n    IF(AND(E59>0,E59<$C$59),E59/$C$59)))","v":0.3},{"$f":"IF(F59>=$C$59,1,\n    IF(F59<=0,0,\n    IF(AND(F59>0,F59<$C$59),F59/$C$59)))","v":0.2}]
[null,null,null,{"$f":"D60/(D60+E60+F60)","v":0.5},{"$f":"E60/(D60+E60+F60)","v":0.3},{"$f":"F60/(D60+E60+F60)","v":0.2}]
[]
[null,"KKEG +",200000]
[null," KABUL EDİLMEYEN GELİRLER -"]
[null,"ZARAR OLSA DAHİ İNDİRİLECEK İSTİSNALAR -",{"$f":"C66+C67+C68","v":0}]
[null,"Hizmet İhracatı Faaliyetinden (KVK 10-1/ğ) Elde Edilen Kazançlardan İstisna Edilenlerin Toplamı"]
[null,"İmalat Faaliyetinden Elde Edilen Kazançlardan İstisna Edilenlerin Toplamı"]
[null,"Diğer Faaliyetlerden Elde Edilen Kazançlardan İstisna Edilenlerin Toplamı"]
[null,"GEÇMİŞ YIL ZARARLARI -",1200000]
[null,"İNDİRİMLER -",null,"AZAMİ YAZILABİLECEK İNDİRİMLER TUTARI",{"$f":"C59+C63-C64-C65-C69","v":2000000}]
[]
[null,"1 PUAN İNDİRİM UYGULANACAK TUTARIN HESABINDA İSTİSNA KAZANÇLAR DÜŞÜLDÜKTEN SONRA BULUNAN TİCARİ KAZANÇ TUTARI İLE  İHRACAT,İMALAT VE DİĞER KAZANÇLARIN TUTARI","TİCARİ KAZANÇ TAN İhracat ve İmalat Kazancından İstisna Olan Tutarlar Düşüldükten Sonra Kalan Tutarı","İhracat Faaliyetinden Elde Edilen  Kazançtan İstisna Olan Kısım Düşüldükten Sonra Bulunan Tutarı","Üretim  Faaliyetinden Elde Edilen  Kazançtan İstisna Olan Kısım Düşüldükten Sonra Bulunan Tutarı","Diğer Faaliyetinden Elde Edilen  Kazanç"]
[null,null,{"$f":"IF(C59-C66-C67<=0,0,C59-C66-C67)","v":3000000},{"$f":"IF($D$59-C66<=0,0,MIN($D$59-C66,$C$73*D61))","v":1500000},{"$f":"IF($E$59-C67<=0,0,MIN($E$59-C67,$C$73*E61))","v":900000},{"$f":"IF(C73-D73-E73<=0,0,C73-D73-E73)","v":600000}]
[null,"MATRAH DAĞITIM PAYLARI",null,{"$f":"IFERROR(IF(D73/C73<=0,0,D73/C73),0)","v":0.5},{"$f":"IFERROR(IF(E73/C73<=0,0,E73/C73),0)","v":0.3},{"$f":"IFERROR(F73/C73,0)","v":0.2}]
[null,"İHRACAT, İMALAT VE DİĞER FAALİYETLERDEN ELDE EDİLEN KAZANCIN TOPLAM TİCARİ KAZANÇ İÇİNDEKİ PAYLARI ",null,{"$f":"IFERROR(IF(AND(D73+E73>C73, F73<=0),1,(D73+E73)/C73),0)","v":0.8},null,{"$f":"IFERROR(IF(F73<=0,0,F73/C73),0)","v":0.2}]
[null,"NEGATİF VE % 100 DEN BÜYÜKLÜK KONTROLÜ SONRASINDAKİ PAYLARI",null,{"$f":"IFERROR(IF(D75<=0,0,IF(D75>1,1,D75)),0)","v":0.8},null,{"$f":"IFERROR(IF(F75<=0,0,IF(F75>1,1,F75)),0)","v":0.2}]
[]
[null,"SAFİ KURUM KAZANCI \n(KURUMLAR VERGİSİ MATRAHI)",{"$f":"C59+C63-C64-C65-C69-C70","v":2000000},{"$f":"IF(C78<0, \"ZARAR\",\"KAR\")","v":"KAR"}]
[]
[null,"2022 YILI 3. DÖNEM İNDİRİMLİ KURUMLAR VERGİSİ HESAPLAMA TABLOSU"]
[null,null,"1. TEŞVİK BELGESİ","2. TEŞVİK BELGESİ","3. TEŞVİK BELGESİ","4. TEŞVİK BELGESİ","5. TEŞVİK BELGESİ"]
[null,"Vergi İndirim Oranı (VİO)"]
[null,"KV MATRAHI (Safi Kurum Kazancı)",{"$f":"C78","v":2000000}]
[null,"32/A  Uygulanacak K.V. Matrahı (HER BİR TEŞVİK BELGESİ KAPSAMINDA YARARLANILABİLECEK YATIRIMA KATKI TUTARININ MATRAHI BU HÜCRELERE YAZILMALIDIR)",null,null,null,null,null,{"$f":"IF(SUM(C84:G84)>C78,\"32/A İNDİRİMİ UYGULANACAK KAZANÇ, SAFİ KURUM KAZANCINDAN FAZLADIR\",SUM(C84:G84))","v":0}]
[null,"32/A UYGULANMAYACAK K.V.  Matrahı",{"$f":"IF(C83-(C84+D84+E84+F84+G84)<0,0,C83-(C84+D84+E84+F84+G84))","v":2000000}]
[null,"MATRAH TOPLAMI",{"$f":"IF((C84+D84+E84+F84+G84+C85)>C78,C78,(C84+D84+E84+F84+G84+C85))","v":2000000}]
[]
[null,"SAFİ KURUM KAZANCININ  KV VERGİ ORANLARI İTİBARİYLE DAĞILIMI ","TOPLAM SAFİ KAZANÇ","İhracat Kazancı Payı","Üretim Kazancı Payı","Diğer Faaliyet Kazancı Payı"]
[]
[null,null,{"$f":"C78","v":2000000},{"$f":"IF(AND(AND($D$59>0,($D$59+$E$59)>=$C$59,D59>=C66),$C$90>=MAX(D59,D73)),\n\nMIN(MAX(IF(D59<=C90,D59,IF(D73<=C90,D73)),$C$90*D74)),\n\nIF(OR(D59<=0,D73<=0),0,\n\nMIN( MAX(   MAX(   IF(D59<=C90,D59),  IF(D73<=C90,D73) ),    MIN($C$90*D74,D59,D73)),$C$90)))","v":1500000},{"$f":"MIN( IF(AND(AND($E$59>0,($D$59+$E$59)>=$C$59,E59>=C67),$C$90>=MAX(E59,E73)),\n\nMIN(MAX(IF(E59<=C90,E59,IF(E73<=C90,E73)),$C$90*E74)),\n\nIF(OR(E59<=0,E73<=0),0,\n\nMIN( MAX(   MAX(   IF(E59<=C90,E59),  IF(E73<=C90,E73) ),    MIN($C$90*E74,E59,E73)),$C$90))),C90-D90)","v":500000},{"$f":"C90-D90-E90","v":0}]
[null,"SAFİ KURUM KAZANCININ DAĞILIMI ORANSAL DAĞILIMI",{"$f":"C90","v":2000000},{"$f":"D90/C90","v":0.75},{"$f":"E90/C90","v":0.25},{"$f":"F90/C90","v":0}]
[null,"SAFİ KURUM KAZANCININ DAĞILIMI TUTARSAL",{"$f":"C91","v":2000000},{"$f":"D90","v":1500000},{"$f":"E90","v":500000},{"$f":"F90","v":0}]
[null,"SAFİ KURUM KAZANCI DAĞILIMI",{"$f":"C92","v":2000000},{"$f":"IFERROR(IF(D92/C92>=1,1,D92/C92),0)","v":0.75},{"$f":"IFERROR(IF(E92/C92>=1,1,E92/C92),0)","v":0.25},{"$f":"IFERROR(IF(F92/C92>=1,1,F92/C92),0)","v":0},null,"KV ORANI"]
[null,"1 PUAN VE 32/A İNDİRİMİ OLMASAYDI HESAPLANAN KV TUTARI",{"$f":"C93*$H$94","v":500000},{"$f":"D92*$H$94","v":375000},{"$f":"E92*$H$94","v":125000},{"$f":"F92*$H$94","v":0},null,0.25]
[null,"32/ A UYGULANAN MATRAH",{"$f":"C84+D84+E84+F84+G84","v":0},{"$f":"D107+D112+D117+D122+D127","v":0},{"$f":"D106+D111+D116+D121+D126","v":0},{"$f":"D105+D110+D115+D120+D125","v":0}]
[null,"32/A UYGULANACAK MATRAH ÜZERİNDEN ÖDENECEK KV TUTARI",{"$f":"J108+J113+J118+J123+J128","v":0},{"$f":"J107+J112+J117+J122+J127","v":0},{"$f":"J106+J111+J116+J121+J126","v":0},{"$f":"J105+J110+J115+J120+J125","v":0}]
[null,"32/A UYGULANMAYAN MATRAH",{"$f":"IF(C85<=0,0,C85)","v":2000000},{"$f":"D132","v":1500000},{"$f":"D131","v":500000},{"$f":"D130","v":0}]
[null,"32/A UYGULANMAYAN MATRAH ÜZERİNDEN ÖDENECEK KV TUTARI",{"$f":"L130","v":420000},{"$f":"J132","v":300000},{"$f":"J131","v":120000},{"$f":"J130","v":0}]
[null,"TOPLAM ÖDENECEK KV",{"$f":"C96+C98","v":420000},{"$f":"J132+J107","v":300000},{"$f":"J131+J106","v":120000},{"$f":"J130+J105","v":0}]
[null,"TOPLAM AVANTAJ  (YARARLANILAN 1 PUAN İNDİRİMİ + 32/A İNDİRİMİ TUTARI )",{"$f":"C94-C99","v":80000},{"$f":"D101+D102","v":75000},{"$f":"E101+E102","v":5000},{"$f":"F101+F102","v":0}]
[null,"YARARLANILAN 1 - 5 PUAN İNDİRİMİ TUTARI",{"$f":"F133+F128+F123+F118+F113+F108","v":80000},{"$f":"F132+F107+F112+F117+F122+F127","v":75000},{"$f":"F131+F106+F111+F116+F121+F126","v":5000},{"$f":"F130+F105+F110+F115+F120+F125","v":0}]
[null,"YARLANILAN 32/A İNDİRİMİ TUTARI",{"$f":"K108+K113+K118+K123+K128+K133","v":0},{"$f":"K107+K112+K122+K127+K132","v":0},{"$f":"K106+K111+K116+K121+K126+K131","v":0},{"$f":"K105++K110+K115+K120+K125+K130","v":0}]
[]
[null,"32/A UYGULANABİLECEK MATRAH (1.TEŞVİK BELGESİ)",{"$f":"C84","v":0},"KV MATRAHI","1 - 5 PUAN İNDİRİM OLMASAYDI HESAPLANAN KV TUTARI","1 -5 Puan İndirim Tutarı","1 - 5 Puan İndirim Sonrasında Hesaplanan KV Tutarı","32/A İndirimi Olmasaydı Ödenecek KV Tutarı","1 -5 Puan İndirim ve 32/A VİO Uygulandıktan Sonra Tatbik Edilecek KV Oranı","1 -5 Puan İndirim ve 32/A İndirimi Uygulandıktan Sonra Ödenecek  KV Tutarı","Yararlanılan Yatırıma Katkı Tutarı\n(32/A İnd. KV Nedeniyle Vazgeçilen Vergi Tutarı)","Ödenecek KV Tutarı"]
[null,"GENEL ORANA TABİ KISIM (DİĞER FAALİYETLER)",{"$f":"F93","v":0},{"$f":"C104*C105","v":0},{"$f":"D105*$H$94","v":0},0,{"$f":"E105-F105","v":0},{"$f":"G105","v":0},{"$f":"($H$94)-(($H$94)*$C$82)","v":0.25},{"$f":"I105*D105","v":0},{"$f":"G105-J105","v":0},{"$f":"J108","v":0}]
[null,"1 PUAN İNDİRİMLİ ORANA TABİ KISIM  (İMALAT)",{"$f":"E93","v":0.25},{"$f":"C104*C106","v":0},{"$f":"D106*$H$94","v":0},{"$f":"D106/100","v":0},{"$f":"E106-F106","v":0},{"$f":"G106","v":0},{"$f":"($H$94-0.01)-(($H$94-0.01)*$C$82)","v":0.24},{"$f":"I106*D106","v":0},{"$f":"G106-J106","v":0}]
[null,"5 PUAN İNDİRİMLİ ORANA TABİ KISIM  ( İHRACAT)",{"$f":"D93","v":0.75},{"$f":"C104*C107","v":0},{"$f":"D107*$H$94","v":0},{"$f":"D107/20","v":0},{"$f":"E107-F107","v":0},0,{"$f":"($H$94-0.05)-(($H$94-0.05)*C82)","v":0.2},0,{"$f":"G107-J107","v":0}]
[null,"TOPLAM",{"$f":"SUM(C105:C107)","v":1},{"$f":"SUM(D105:D107)","v":0},0,{"$f":"SUM(F105:F107)","v":0},{"$f":"SUM(G105:G107)","v":0},{"$f":"SUM(H105:H107)","v":0},null,0,0]
[null,"32/A UYGULANABİLECEK MATRAH (2.TEŞVİK BELGESİ)",{"$f":"D84","v":0},"KV MATRAHI","1 - 5 PUAN İNDİRİM OLMASAYDI HESAPLANAN KV TUTARI","1 -5 Puan İndirim Tutarı","1 -5 Puan İndirim Sonrasında Hesaplanan KV Tutarı","32/A İndirimi Olmasaydı Ödenecek KV Tutarı","1 - 5 Puan İndirim ve 32/A VİO Uygulandıktan Sonra Tatbik Edilecek KV Oranı","1-5  Puan İndirim ve 32/A İndirimi Uygulandıktan Sonra Ödenecek  KV Tutarı","Yararlanılan Yatırıma Katkı Tutarı\n(32/A İnd. KV Nedeniyle Vazgeçilen Vergi Tutarı)","Ödenecek KV Tutarı"]
[null,"GENEL ORANA TABİ KISIM (DİĞER FAALİYETLER)",{"$f":"F93","v":0},{"$f":"C109*C110","v":0},{"$f":"D110*$H$94","v":0},0,{"$f":"E110-F110","v":0},{"$f":"G110","v":0},{"$f":"($H$94)-(($H$94)*D82)","v":0.25},{"$f":"I110*D110","v":0},{"$f":"G110-J110","v":0},{"$f":"J113","v":0}]
[null,"1 PUAN İNDİRİMLİ ORANA TABİ KISIM  (İMALAT)",{"$f":"E93","v":0.25},{"$f":"C109*C111","v":0},{"$f":"D111*$H$94","v":0},{"$f":"D111/100","v":0},{"$f":"E111-F111","v":0},{"$f":"G111","v":0},{"$f":"($H$94-0.01)-(($H$94-0.01)*D82)","v":0.24},{"$f":"I111*D111","v":0},{"$f":"G111-J111","v":0}]
[null,"5 PUAN İNDİRİMLİ ORANA TABİ KISIM  ( İHRACAT)",{"$f":"D93","v":0.75},{"$f":"C109*C112","v":0},{"$f":"D112*$H$94","v":0},{"$f":"D112/20","v":0},{"$f":"E112-F112","v":0},0,{"$f":"($H$94-0.05)-(($H$94-0.05)*D82)","v":0.2},0,{"$f":"G112-J112","v":0}]
[null,"TOPLAM",{"$f":"SUM(C110:C112)","v":1},0,0,{"$f":"SUM(F110:F112)","v":0},{"$f":"SUM(G110:G112)","v":0},{"$f":"SUM(H110:H112)","v":0},null,{"$f":"SUM(J110:J112)","v":0},0]
[null,"32/A UYGULANABİLECEK MATRAH (3.TEŞVİK BELGESİ)",{"$f":"E84","v":0},"KV MATRAHI","1 - 5 PUAN İNDİRİM OLMASAYDI HESAPLANAN KV TUTARI","1-5 Puan İndirim Tutarı","1 - 5 Puan İndirim Sonrasında Hesaplanan KV Tutarı","32/A İndirimi Olmasaydı Ödenecek KV Tutarı","1 - 5 Puan İndirim ve 32/A VİO Uygulandıktan Sonra Tatbik Edilecek KV Oranı","1 -5 Puan İndirim ve 32/A İndirimi Uygulandıktan Sonra Ödenecek  KV Tutarı","Yararlanılan Yatırıma Katkı Tutarı\n(32/A İnd. KV Nedeniyle Vazgeçilen Vergi Tutarı)","Ödenecek KV Tutarı"]
[null,"GENEL ORANA TABİ KISIM (DİĞER FAALİYETLER)",{"$f":"F93","v":0},{"$f":"C114*C115","v":0},{"$f":"D115*$H$94","v":0},0,{"$f":"E115-F115","v":0},{"$f":"G115","v":0},{"$f":"($H$94)-(($H$94)*E82)","v":0.25},{"$f":"I115*D115","v":0},{"$f":"G115-J115","v":0},{"$f":"J118","v":0}]
[null,"1 PUAN İNDİRİMLİ ORANA TABİ KISIM  (İMALAT)",{"$f":"E93","v":0.25},{"$f":"C114*C116","v":0},{"$f":"D116*$H$94","v":0},{"$f":"D116/100","v":0},{"$f":"E116-F116","v":0},{"$f":"G116","v":0},{"$f":"($H$94-0.01)-(($H$94-0.01)*E82)","v":0.24},{"$f":"I116*D116","v":0},{"$f":"G116-J116","v":0}]
[null,"5 PUAN İNDİRİMLİ ORANA TABİ KISIM  ( İHRACAT)",{"$f":"D93","v":0.75},{"$f":"C114*C117","v":0},{"$f":"D117*$H$94","v":0},{"$f":"D117/20","v":0},{"$f":"E117-F117","v":0},0,{"$f":"($H$94-0.05)-(($H$94-0.05)*E82)","v":0.2},0,{"$f":"G117-J117","v":0}]
[null,"TOPLAM",{"$f":"SUM(C115:C117)","v":1},0,0,{"$f":"SUM(F115:F117)","v":0},{"$f":"SUM(G115:G117)","v":0},{"$f":"SUM(H115:H117)","v":0},null,{"$f":"SUM(J115:J117)","v":0},0]
[null,"32/A UYGULANABİLECEK MATRAH (4. TEŞVİK BELGESİ)",{"$f":"F84","v":0},"KV MATRAHI","1 - 5 PUAN İNDİRİM OLMASAYDI HESAPLANAN KV TUTARI","1-5 Puan İndirim Tutarı","1 -5 Puan İndirim Sonrasında Hesaplanan KV Tutarı","32/A İndirimi Olmasaydı Ödenecek KV Tutarı","1- 5  Puan İndirim ve 32/A VİO Uygulandıktan Sonra Tatbik Edilecek KV Oranı","1-5 Puan İndirim ve 32/A İndirimi Uygulandıktan Sonra Ödenecek  KV Tutarı","Yararlanılan Yatırıma Katkı Tutarı\n(32/A İnd. KV Nedeniyle Vazgeçilen Vergi Tutarı)","Ödenecek KV Tutarı"]
[null,"GENEL ORANA TABİ KISIM (DİĞER FAALİYETLER)",{"$f":"F93","v":0},{"$f":"C119*C120","v":0},{"$f":"D120*$H$94","v":0},0,{"$f":"E120-F120","v":0},{"$f":"G120","v":0},{"$f":"($H$94)-(($H$94)*F82)","v":0.25},{"$f":"I120*D120","v":0},{"$f":"G120-J120","v":0},{"$f":"J123","v":0}]
[null,"1 PUAN İNDİRİMLİ ORANA TABİ KISIM  (İMALAT)",{"$f":"E93","v":0.25},{"$f":"C119*C121","v":0},{"$f":"D121*$H$94","v":0},{"$f":"D121/100","v":0},{"$f":"E121-F121","v":0},{"$f":"G121","v":0},{"$f":"($H$94-0.01)-(($H$94-0.01)*F82)","v":0.24},{"$f":"I121*D121","v":0},{"$f":"G121-J121","v":0}]
[null,"5 PUAN İNDİRİMLİ ORANA TABİ KISIM  ( İHRACAT)",{"$f":"D93","v":0.75},{"$f":"C119*C122","v":0},{"$f":"D122*$H$94","v":0},{"$f":"D122/20","v":0},{"$f":"E122-F122","v":0},0,{"$f":"($H$94-0.05)-(($H$94-0.05)*F82)","v":0.2},0,{"$f":"G122-J122","v":0}]
[null,"TOPLAM",{"$f":"SUM(C120:C122)","v":1},0,0,{"$f":"SUM(F120:F122)","v":0},{"$f":"SUM(G120:G122)","v":0},{"$f":"SUM(H120:H122)","v":0},null,{"$f":"SUM(J120:J122)","v":0},0]
[null,"32/A UYGULANABİLECEK MATRAH (5.TEŞVİK BELGESİ)",{"$f":"G84","v":0},"KV MATRAHI","1 - 5 PUAN İNDİRİM OLMASAYDI HESAPLANAN KV TUTARI","1-5 Puan İndirim Tutarı","1 - 5 Puan İndirim Sonrasında Hesaplanan KV Tutarı","32/A İndirimi Olmasaydı Ödenecek KV Tutarı","1 -5 Puan İndirim ve 32/A VİO Uygulandıktan Sonra Tatbik Edilecek KV Oranı","1 - 5 Puan İndirim ve 32/A İndirimi Uygulandıktan Sonra Ödenecek  KV Tutarı","Yararlanılan Yatırıma Katkı Tutarı\n(32/A İnd. KV Nedeniyle Vazgeçilen Vergi Tutarı)","Ödenecek KV Tutarı"]
[null,"GENEL ORANA TABİ KISIM (DİĞER FAALİYETLER)",{"$f":"F93","v":0},{"$f":"C124*C125","v":0},{"$f":"D125*$H$94","v":0},0,{"$f":"E125-F125","v":0},{"$f":"G125","v":0},{"$f":"($H$94)-(($H$94)*G82)","v":0.25},{"$f":"I125*D125","v":0},{"$f":"G125-J125","v":0},{"$f":"J128","v":0}]
[null,"1 PUAN İNDİRİMLİ ORANA TABİ KISIM  (İMALAT)",{"$f":"E93","v":0.25},{"$f":"C124*C126","v":0},{"$f":"D126*$H$94","v":0},{"$f":"D126/100","v":0},{"$f":"E126-F126","v":0},{"$f":"G126","v":0},{"$f":"($H$94-0.01)-(($H$94-0.01)*G82)","v":0.24},{"$f":"I126*D126","v":0},{"$f":"G126-J126","v":0}]
[null,"5 PUAN İNDİRİMLİ ORANA TABİ KISIM  ( İHRACAT)",{"$f":"D93","v":0.75},{"$f":"C124*C127","v":0},{"$f":"D127*$H$94","v":0},{"$f":"D127/20","v":0},{"$f":"E127-F127","v":0},0,{"$f":"($H$94-0.05)-(($H$94-0.05)*G82)","v":0.2},0,{"$f":"G127-J127","v":0}]
[null,"TOPLAM",{"$f":"SUM(C125:C127)","v":1},0,0,{"$f":"SUM(F125:F127)","v":0},{"$f":"SUM(G125:G127)","v":0},{"$f":"SUM(H125:H127)","v":0},null,{"$f":"SUM(J125:J127)","v":0},0]
[null,"32/A UYGULANAMAYACAK MATRAH",{"$f":"IF(C85<=0,0,C85)","v":2000000},"KV MATRAHI","1-5 PUAN İNDİRİM OLMASAYDI HESAPLANAN KV TUTARI","1-5 Puan İndirim Tutarı","1 -5 Puan İndirim Sonrasında Hesaplanan KV Tutarı","32/A İNDİRİMİ UYGULANMAZ",null,"1 Puan İndirim ve 32/A İndirimi Uygulandıktan Sonra Ödenecek  KV Tutarı","Yararlanılan Yatırıma Katkı Tutarı\n(32/A İnd. KV Nedeniyle Vazgeçilen Vergi Tutarı)","Ödenecek KV Tutarı"]
[null,"GENEL ORANA TABİ KISIM (DİĞER FAALİYETLER)",{"$f":"F93","v":0},{"$f":"C129*C130","v":0},{"$f":"D130*$H$94","v":0},0,{"$f":"E130-F130","v":0},null,null,{"$f":"G130","v":0},{"$f":"G130-J130","v":0},{"$f":"J133","v":420000}]
[null,"1 PUAN İNDİRİMLİ ORANA TABİ KISIM  (İMALAT)",{"$f":"E93","v":0.25},{"$f":"C131*C129","v":500000},{"$f":"D131*$H$94","v":125000},{"$f":"D131/100","v":5000},{"$f":"E131-F131","v":120000},null,null,{"$f":"G131","v":120000},{"$f":"G131-J131","v":0}]
[null,"5 PUAN İNDİRİMLİ ORANA TABİ KISIM  ( İHRACAT)",{"$f":"D93","v":0.75},{"$f":"C132*C129","v":1500000},{"$f":"D132*$H$94","v":375000},{"$f":"D132/20","v":75000},{"$f":"E132-F132","v":300000},null,null,300000,0]
[null,"TOPLAM",{"$f":"SUM(C130:C132)","v":1},{"$f":"SUM(D130:D132)","v":2000000},500000,{"$f":"SUM(F130:F132)","v":80000},{"$f":"SUM(G130:G132)","v":420000},null,null,420000,0]
[null,"TOPLAM KV MATRAHI VE ÖDENMESİ GEREKEN KV ",{"$f":"C104+C129+C109+C114+C119+C124","v":2000000},{"$f":"D108+D133+D113+D118+D123+D128","v":2000000},{"$f":"E108+E133+E113+E118+E123+E128","v":500000},{"$f":"F108+F133+F113+F118+F123+F128","v":80000},{"$f":"G108+G133+G113+G118+G123+G128","v":420000},null,null,{"$f":"J108+J133+J113+J118+J123+J128","v":420000},{"$f":"K133+K108+K113+K118+K123+K128","v":0},{"$f":"L105+L130+L110+L115+L120+L125","v":420000}]
[]
[null,"GEÇİCİ VERGİ BEYANNMESİNDE MATRAH BİLDİRİMİ BÖLÜMÜNDE DOLDURULACAK KISIMLAR VE TUTARLARI"]
[null,"32 A Madde Kapsamında İndirimli Kurumlar Vergisine (Geçici Vergiye) Tabi Matrah",{"$f":"C104+C109+C114+C119+C124","v":0},{"$f":"E108+E113+E118+E123+E128","v":0},"1-5 Puan Olmasaydı Hesaplan KV Tutarı"]
[null,null,null,{"$f":"G108+G113+G118+G123++G128","v":0},"1 -5 Puan İndirim Sonrasında Ödenecek KV Tutarı\n (32 A olmasaydı hesaplanacak Vergi)"]
[null,null,null,{"$f":"K108+K113+K118+K123+K128","v":0},"32/A İndirimi ile Vazgeçilen Vergi"]
[null,"32 A Madde Kapsamında İndirimli Kurumlar Vergisi(Geçici Vergi) Oranı",{"$f":"IFERROR(D140/C137,0)","v":0},{"$f":"L105+L110+L115+L120+L125","v":0},"32/A ya Tabi Matrah Üzerinden Ödenecek KV"]
[null,"32/7 Madde Kapsamında İndirimli Kurumlar Vergisine (Geçici Vergiye) Tabi Matrah  (İhracat)",{"$f":"D132","v":1500000},{"$f":"E132","v":375000},"5 Puan Olmasaydı Hesaplan KV Tutarı"]
[null,null,null,{"$f":"F132","v":75000},"5 Puan İndirimin Vergi Etkisi "]
[null,"32/7 Madde Kapsamında İndirimli Kurumlar Vergisi (Geçici Vergi) Oranı",{"$f":"IFERROR(D143/C141,0)","v":0.2},{"$f":"G132","v":300000},"5 Puan İndirim Sonrasında Ödenecek KV Tutarı (İhracat)\n"]
[null,"32/8 Madde Kapsamında İndirimli Kurumlar Vergisine (Geçici Vergiye) Tabi Matrah  (Üretim)",{"$f":"D131","v":500000},{"$f":"E131","v":125000},"1 Puan Olmasaydı Hesaplan KV Tutarı"]
[null,null,null,{"$f":"F131","v":5000},"1 Puan İndirimin Vergi Etkisi "]
[null,"32/8 Madde Kapsamında İndirimli Kurumlar Vergisi (Geçici Vergi) Oranı",{"$f":"IFERROR(D146/C144,0)","v":0.24},{"$f":"G131","v":120000},"1 Puan İndirim Sonrasında Ödenecek KV Tutarı (Üretim)\n"]
[null,"Genel Orana Tabi Matrah (Diğer)",{"$f":"D130","v":0},{"$f":"J130","v":0},"Diğer Faalilyetlerden Elde Edilen Kazanç"]
[null,null,{"$f":"IFERROR(D147/C147,0)","v":0}]
[null,"MATRAHLAR TOPLAMI",{"$f":"C137+C144+C141+C147","v":2000000},{"$f":"D140+D146+D143+D147","v":420000}]

{"sheet":"İÜ Ö3","index":11,"n_rows":149,"n_cols":12,"rows_kept":149,"cut":false,"hidden":true,"merged":[[84,2,84,6],[1,1,2,1],[59,1,59,2],[60,1,60,2],[71,1,72,1],[73,1,73,2],[74,1,74,2],[74,3,74,4],[75,1,75,2],[75,3,75,4],[79,1,79,3],[82,2,82,6],[85,2,85,6],[87,1,89,1],[87,2,88,2],[87,3,88,3],[87,4,88,4],[87,5,88,5],[135,1,135,4],[137,1,138,2],[104,11,107,11],[109,11,112,11],[114,11,117,11],[119,11,122,11],[124,11,127,11],[128,7,133,8],[129,11,132,11]]}
[]
[null,"FAALİYET TÜRLERİ İTİBARİYLE HASILATLAR VE TOPLAM İÇİNDEKİ ORANLARI",{"$f":"IFERROR(C4/C4,0)","v":1},{"$f":"IFERROR(D4/C4,0)","v":0.2},{"$f":"IFERROR(E4/C4,0)","v":0.3},{"$f":"IFERROR(F4/C4,0)","v":0.5}]
[null,null,"Toplam Hasılat","İhracat faaliyeti","İmalat faaliyeti","Diğer faaliyetler"]
[null,"A-BRÜT SATIŞLAR (60)",{"$f":"D4+E4+F4","v":2000000},{"$f":"SUM(D5:D7)","v":400000},{"$f":"SUM(E5:E7)","v":600000},1000000]
[null,"1-Yurtiçi Satışlar (600)",{"$f":"D5+E5+F5","v":1400000},null,1400000]
[null,"2-Yurtdışı Satışlar (601)",{"$f":"D6+E6+F6","v":400000},400000]
[null,"3-Diğer Gelirler (602)",{"$f":"D7+E7+F7","v":200000},null,-800000,1000000]
[null,"B-SATIŞ İNDİRİMLERİ(-) (61)",{"$f":"SUM(C9:C11)","v":0},{"$f":"SUM(D9:D11)","v":0},{"$f":"SUM(E9:E11)","v":0},0]
[null,"1-Satıştan İadeler (-) (610)",{"$f":"SUM(D9:F9)","v":0}]
[null,"2- Satış İskontoları (-) (611)",{"$f":"SUM(D10:F10)","v":0}]
[null,"3-Diğer İndirimler (-) (612)",0]
[null,"C-NET SATIŞLAR",{"$f":"C4-C8","v":2000000},{"$f":"D4-D8","v":400000},{"$f":"E4-E8","v":600000},1000000]
[null,"D-SATIŞLARIN MALİYETİ (-) (62)",{"$f":"SUM(C14:C17)","v":0},{"$f":"SUM(D14:D17)","v":0},{"$f":"SUM(E14:E17)","v":0},{"$f":"SUM(F14:F17)","v":0}]
[null,"1-Satılan Mamuller Maliyeti ( 620)",{"$f":"SUM(D14:F14)","v":0}]
[null,"2-Satılan Ticari Mal Maliyeti (621)",{"$f":"SUM(D15:F15)","v":0}]
[null,"3-Satılan Hizmet Maliyeti (622)",0]
[null,"4-Diğer Satışların Maliyeti (623)",0]
[null,"BRÜT SATIŞ KARI / ZARARI",{"$f":"C12-C13","v":2000000},{"$f":"D12-D13","v":400000},{"$f":"E12-E13","v":600000},1000000]
[null,"E-FAALİYET GİDERLERİ (-) (63)",{"$f":"SUM(C20:C24)","v":0},{"$f":"SUM(D20:D24)","v":0},{"$f":"SUM(E20:E24)","v":0},0]
[null,"1-Araştırma ve Geliştirme Giderleri(-) (630)",{"$f":"SUM(D20:F20)","v":0}]
[null,"2-Pazarlama, Satış ve Dağıtım Giderleri(-) (631)",{"$f":"SUM(D21:F21)","v":0}]
[null,"3-Genel Yönetim Giderleri(-) (632)",{"$f":"SUM(D22:F22)","v":0}]
[null,"MÜŞTEREK GENEL GİDERLER (DAĞITIM-HASILAT PAYINA GÖRE)",null,{"$f":"C23*D2","v":0},{"$f":"C23*E2","v":0},{"$f":"C23*F2","v":0}]
[null,"MÜŞTEREK GENEL GİDER GİBİ DAĞITIMA TABİ TUTULACAK AMORTİSMAN GİDERLERİ  (DAĞITIM-HASILAT PAYINA GÖRE)",null,{"$f":"C24*D2","v":0},{"$f":"C24*E2","v":0},{"$f":"C24*F2","v":0}]
[null,"FAALİYET KARI / ZARARI ",{"$f":"C18-C19","v":2000000},{"$f":"D18-D19","v":400000},{"$f":"E18-E19","v":600000},1000000]
[null,"F-DİĞER FAALİYETLERDEN OLAĞAN GELİR VE KARLAR (64)",{"$f":"SUM(C27:C35)","v":0},{"$f":"SUM(D27:D35)","v":0},{"$f":"SUM(E27:E35)","v":0},{"$f":"SUM(F27:F35)","v":0}]
[null,"         1- İŞTİRAKLERDEN TEMETTÜ GELİRLERİ (640)",{"$f":"SUM(D27:F27)","v":0}]
[null,"         2- BAĞLI ORTAKLIKLARDAN TEMETTÜ GELİRLERİ (641)",{"$f":"SUM(D28:F28)","v":0}]
[null,"         3- FAİZ GELİRLERİ (642) (ihracat ve imalat kaynaklı alacağın tahsiline kadar olan süreçte oluşan)",0]
[null,"         4- KOMİSYON GELİRLERİ (643)",0]
[null,"         5- KONUSU OLMAYAN KARŞILIKLAR (644)",0]
[null,"         6- MENKUL KIYMET SATIŞ KARLARI (645)",0]
[null,"         7- KAMBİYO KARLARI (646) (ihracat ve imalat kaynaklı alacağın tahsiline kadar olan süreçte oluşan)",0]
[null,"         8- REESKONT FAİZ GELİRLERİ (647)",0]
[null,"         9- FAALİYETLE İLGİLİ DİĞER GELİR VE KARLAR (649)",0]
[null,"ARA TOPLAM",{"$f":"C25+C26","v":2000000},{"$f":"D25+D26","v":400000},{"$f":"E25+E26","v":600000},{"$f":"F25+F26","v":1000000}]
[null,"G-DİĞER FAALİYETLERDEN OLAĞAN GİDER VE ZARARLAR(-) (65)",{"$f":"SUM(C38:C43)","v":0},{"$f":"SUM(D38:D43)","v":0},{"$f":"SUM(E38:E43)","v":0},0]
[null,"         1- KOMİSYON GİDERLERİ (653)",{"$f":"SUM(D38:F38)","v":0}]
[null,"         2- KARŞILIK GİDERLERİ (654)",{"$f":"SUM(D39:F39)","v":0}]
[null,"         3- MENKUL KIYMET SATIŞ ZARARLARI (655)",0]
[null,"         4- KAMBİYO ZARARLARI (656) (ihracat ve imalat kaynaklı alacağın tahsiline kadar olan süreçte oluşan)",0]
[null,"         5- REESKONT FAİZ GİDERLERİ (657)",0]
[null,"         6- DİĞER OLAĞAN GİDER VE ZARARLAR (659)",{"$f":"SUM(D43:F43)","v":0}]
[null,"ARA TOPLAM",{"$f":"C36-C37","v":2000000},{"$f":"D36-D37","v":400000},{"$f":"E36-E37","v":600000},1000000]
[null,"H-FİNANSMAN GİDERLERİ(-) (66)",{"$f":"SUM(C46:C49)","v":0},{"$f":"SUM(D46:D49)","v":0},{"$f":"SUM(E46:E49)","v":0},{"$f":"SUM(F46:F49)","v":0}]
[null,"         1- KISA VADELİ BORÇLANMA GİDERLERİ (-)",{"$f":"SUM(D46:F46)","v":0}]
[null,"         2- UZUN VADELİ BORÇLANMA GİDERLERİ (-)",{"$f":"SUM(D47:F47)","v":0}]
[null,"         1- KISA VADELİ BORÇLANMA GİDERLERİ (-) (DAĞITIM)",null,{"$f":"C48*D2","v":0},{"$f":"C48*E2","v":0},{"$f":"C48*F2","v":0}]
[null,"         2- UZUN VADELİ BORÇLANMA GİDERLERİ (-) (DAĞITIM)",null,{"$f":"C49*D2","v":0},{"$f":"C49*E2","v":0},{"$f":"C49*F2","v":0}]
[null,"ARA TOPLAM",{"$f":"C44-C45","v":2000000},{"$f":"D44-D45","v":400000},{"$f":"E44-E45","v":600000},{"$f":"F44-F45","v":1000000}]
[null,"I-OLAĞANDIŞI GELİR VE KÂRLAR (67)",{"$f":"SUM(D51:F51)","v":0},{"$f":"SUM(D52:D53)","v":0},{"$f":"SUM(E52:E53)","v":0},{"$f":"SUM(F52:F53)","v":0}]
[null,"1- ÖNCEKİ DÖNEM GELİR VE KARLARI (671)",{"$f":"SUM(D52:F52)","v":0}]
[null,"2-DİĞER OLAĞAN DIŞI GELİR VE KARLAR (679)",{"$f":"SUM(D53:F53)","v":0}]
[null,"ARA TOPLAM",{"$f":"SUM(D54:F54)","v":2000000},{"$f":"D50+D51","v":400000},{"$f":"E50+E51","v":600000},1000000]
[null,"J-OLAĞANDIŞI GİDER VE ZARARLAR(-) (68)",{"$f":"SUM(C56:C58)","v":0},{"$f":"SUM(D56:D58)","v":0},{"$f":"SUM(E56:E58)","v":0},0]
[null,"1-Çalışmayan Kısım Gider ve Zararları(-) (680)",{"$f":"SUM(D56:F56)","v":0}]
[null,"2-Önceki Dönem Gider ve Zararları(-) (681)",{"$f":"SUM(D57:F57)","v":0}]
[null,"3-Diğer Olağan Dışı Gider ve Zararlar(-) (689)",0]
[null,"DÖNEM KÂRI VEYA ZARARI \n(TİCARİ BİLANÇO KARI ZARARI )",{"$f":"C54-C55","v":2000000},{"$f":"D54-D55","v":400000},{"$f":"E54-E55","v":600000},1000000]
[null,"İHRACAT, İMALAT VE DİĞER FAALİYETLERDEN ELDE EDİLEN KAZANCIN TOPLAM TİCARİ KAZANÇ İÇİNDEKİ PAYLARI  \n\n(Kazançlar arasında Öncelik İhracat Kazancına Verilmiştir. İhrcat Kazancından arta kalan Ticari Kazanç İmalat ve Diğer Faaliyetlere Sayılmıştır.)\n\n",null,{"$f":"IF(D59>=$C$59,1,\n    IF(D59<=0,0,\n    IF(AND(D59>0,D59<$C$59),D59/$C$59)))","v":0.2},{"$f":"IF(E59>=$C$59,1,\n    IF(E59<=0,0,\n    IF(AND(E59>0,E59<$C$59),E59/$C$59)))","v":0.3},{"$f":"IF(F59>=$C$59,1,\n    IF(F59<=0,0,\n    IF(AND(F59>0,F59<$C$59),F59/$C$59)))","v":0.5}]
[null,null,null,{"$f":"D60/(D60+E60+F60)","v":0.2},{"$f":"E60/(D60+E60+F60)","v":0.3},{"$f":"F60/(D60+E60+F60)","v":0.5}]
[]
[null,"KKEG +",500000]
[null," KABUL EDİLMEYEN GELİRLER -"]
[null,"ZARAR OLSA DAHİ İNDİRİLECEK İSTİSNALAR -",{"$f":"C66+C67+C68","v":0}]
[null,"Hizmet İhracatı Faaliyetinden (KVK 10-1/ğ) Elde Edilen Kazançlardan İstisna Edilenlerin Toplamı"]
[null,"İmalat Faaliyetinden Elde Edilen Kazançlardan İstisna Edilenlerin Toplamı"]
[null,"Diğer Faaliyetlerden Elde Edilen Kazançlardan İstisna Edilenlerin Toplamı"]
[null,"GEÇMİŞ YIL ZARARLARI -",1200000]
[null,"İNDİRİMLER -",null,"AZAMİ YAZILABİLECEK İNDİRİMLER TUTARI",{"$f":"C59+C63-C64-C65-C69","v":1300000}]
[]
[null,"1 PUAN İNDİRİM UYGULANACAK TUTARIN HESABINDA İSTİSNA KAZANÇLAR DÜŞÜLDÜKTEN SONRA BULUNAN TİCARİ KAZANÇ TUTARI İLE  İHRACAT,İMALAT VE DİĞER KAZANÇLARIN TUTARI","TİCARİ KAZANÇ TAN İhracat ve İmalat Kazancından İstisna Olan Tutarlar Düşüldükten Sonra Kalan Tutarı","İhracat Faaliyetinden Elde Edilen  Kazançtan İstisna Olan Kısım Düşüldükten Sonra Bulunan Tutarı","Üretim  Faaliyetinden Elde Edilen  Kazançtan İstisna Olan Kısım Düşüldükten Sonra Bulunan Tutarı","Diğer Faaliyetinden Elde Edilen  Kazanç"]
[null,null,{"$f":"IF(C59-C66-C67<=0,0,C59-C66-C67)","v":2000000},{"$f":"IF($D$59-C66<=0,0,MIN($D$59-C66,$C$73*D61))","v":400000},{"$f":"IF($E$59-C67<=0,0,MIN($E$59-C67,$C$73*E61))","v":600000},{"$f":"IF(C73-D73-E73<=0,0,C73-D73-E73)","v":1000000}]
[null,"MATRAH DAĞITIM PAYLARI",null,{"$f":"IFERROR(IF(D73/C73<=0,0,D73/C73),0)","v":0.2},{"$f":"IFERROR(IF(E73/C73<=0,0,E73/C73),0)","v":0.3},{"$f":"IFERROR(F73/C73,0)","v":0.5}]
[null,"İHRACAT, İMALAT VE DİĞER FAALİYETLERDEN ELDE EDİLEN KAZANCIN TOPLAM TİCARİ KAZANÇ İÇİNDEKİ PAYLARI ",null,{"$f":"IFERROR(IF(AND(D73+E73>C73, F73<=0),1,(D73+E73)/C73),0)","v":0.5},null,{"$f":"IFERROR(IF(F73<=0,0,F73/C73),0)","v":0.5}]
[null,"NEGATİF VE % 100 DEN BÜYÜKLÜK KONTROLÜ SONRASINDAKİ PAYLARI",null,{"$f":"IFERROR(IF(D75<=0,0,IF(D75>1,1,D75)),0)","v":0.5},null,{"$f":"IFERROR(IF(F75<=0,0,IF(F75>1,1,F75)),0)","v":0.5}]
[]
[null,"SAFİ KURUM KAZANCI \n(KURUMLAR VERGİSİ MATRAHI)",{"$f":"C59+C63-C64-C65-C69-C70","v":1300000},{"$f":"IF(C78<0, \"ZARAR\",\"KAR\")","v":"KAR"}]
[]
[null,"2022 YILI 3. DÖNEM İNDİRİMLİ KURUMLAR VERGİSİ HESAPLAMA TABLOSU"]
[null,null,"1. TEŞVİK BELGESİ","2. TEŞVİK BELGESİ","3. TEŞVİK BELGESİ","4. TEŞVİK BELGESİ","5. TEŞVİK BELGESİ"]
[null,"Vergi İndirim Oranı (VİO)"]
[null,"KV MATRAHI (Safi Kurum Kazancı)",{"$f":"C78","v":1300000}]
[null,"32/A  Uygulanacak K.V. Matrahı (HER BİR TEŞVİK BELGESİ KAPSAMINDA YARARLANILABİLECEK YATIRIMA KATKI TUTARININ MATRAHI BU HÜCRELERE YAZILMALIDIR)",null,null,null,null,null,{"$f":"IF(SUM(C84:G84)>C78,\"32/A İNDİRİMİ UYGULANACAK KAZANÇ, SAFİ KURUM KAZANCINDAN FAZLADIR\",SUM(C84:G84))","v":0}]
[null,"32/A UYGULANMAYACAK K.V.  Matrahı",{"$f":"IF(C83-(C84+D84+E84+F84+G84)<0,0,C83-(C84+D84+E84+F84+G84))","v":1300000}]
[null,"MATRAH TOPLAMI",{"$f":"IF((C84+D84+E84+F84+G84+C85)>C78,C78,(C84+D84+E84+F84+G84+C85))","v":1300000}]
[]
[null,"SAFİ KURUM KAZANCININ  KV VERGİ ORANLARI İTİBARİYLE DAĞILIMI ","TOPLAM SAFİ KAZANÇ","İhracat Kazancı Payı","Üretim Kazancı Payı","Diğer Faaliyet Kazancı Payı"]
[]
[null,null,{"$f":"C78","v":1300000},{"$f":"IF(AND(AND($D$59>0,($D$59+$E$59)>=$C$59,D59>=C66),$C$90>=MAX(D59,D73)),\n\nMIN(MAX(IF(D59<=C90,D59,IF(D73<=C90,D73)),$C$90*D74)),\n\nIF(OR(D59<=0,D73<=0),0,\n\nMIN( MAX(   MAX(   IF(D59<=C90,D59),  IF(D73<=C90,D73) ),    MIN($C$90*D74,D59,D73)),$C$90)))","v":400000},{"$f":"MIN( IF(AND(AND($E$59>0,($D$59+$E$59)>=$C$59,E59>=C67),$C$90>=MAX(E59,E73)),\n\nMIN(MAX(IF(E59<=C90,E59,IF(E73<=C90,E73)),$C$90*E74)),\n\nIF(OR(E59<=0,E73<=0),0,\n\nMIN( MAX(   MAX(   IF(E59<=C90,E59),  IF(E73<=C90,E73) ),    MIN($C$90*E74,E59,E73)),$C$90))),C90-D90)","v":600000},{"$f":"C90-D90-E90","v":300000}]
[null,"SAFİ KURUM KAZANCININ DAĞILIMI ORANSAL DAĞILIMI",{"$f":"C90","v":1300000},{"$f":"D90/C90","v":0.30769230769230771},{"$f":"E90/C90","v":0.46153846153846156},{"$f":"F90/C90","v":0.23076923076923078}]
[null,"SAFİ KURUM KAZANCININ DAĞILIMI TUTARSAL",{"$f":"C91","v":1300000},{"$f":"D90","v":400000},{"$f":"E90","v":600000},{"$f":"F90","v":300000}]
[null,"SAFİ KURUM KAZANCI DAĞILIMI",{"$f":"C92","v":1300000},{"$f":"IFERROR(IF(D92/C92>=1,1,D92/C92),0)","v":0.30769230769230771},{"$f":"IFERROR(IF(E92/C92>=1,1,E92/C92),0)","v":0.46153846153846156},{"$f":"IFERROR(IF(F92/C92>=1,1,F92/C92),0)","v":0.23076923076923078},null,"KV ORANI"]
[null,"1 PUAN VE 32/A İNDİRİMİ OLMASAYDI HESAPLANAN KV TUTARI",{"$f":"C93*$H$94","v":325000},{"$f":"D92*$H$94","v":100000},{"$f":"E92*$H$94","v":150000},{"$f":"F92*$H$94","v":75000},null,0.25]
[null,"32/ A UYGULANAN MATRAH",{"$f":"C84+D84+E84+F84+G84","v":0},{"$f":"D107+D112+D117+D122+D127","v":0},{"$f":"D106+D111+D116+D121+D126","v":0},{"$f":"D105+D110+D115+D120+D125","v":0}]
[null,"32/A UYGULANACAK MATRAH ÜZERİNDEN ÖDENECEK KV TUTARI",{"$f":"J108+J113+J118+J123+J128","v":0},{"$f":"J107+J112+J117+J122+J127","v":0},{"$f":"J106+J111+J116+J121+J126","v":0},{"$f":"J105+J110+J115+J120+J125","v":0}]
[null,"32/A UYGULANMAYAN MATRAH",{"$f":"IF(C85<=0,0,C85)","v":1300000},{"$f":"D132","v":400000},{"$f":"D131","v":600000},{"$f":"D130","v":300000}]
[null,"32/A UYGULANMAYAN MATRAH ÜZERİNDEN ÖDENECEK KV TUTARI",{"$f":"L130","v":299000},{"$f":"J132","v":80000},{"$f":"J131","v":144000},{"$f":"J130","v":75000}]
[null,"TOPLAM ÖDENECEK KV",{"$f":"C96+C98","v":299000},{"$f":"J132+J107","v":80000},{"$f":"J131+J106","v":144000},{"$f":"J130+J105","v":75000}]
[null,"TOPLAM AVANTAJ  (YARARLANILAN 1 PUAN İNDİRİMİ + 32/A İNDİRİMİ TUTARI )",{"$f":"C94-C99","v":26000},{"$f":"D101+D102","v":20000},{"$f":"E101+E102","v":6000},{"$f":"F101+F102","v":0}]
[null,"YARARLANILAN 1 - 5 PUAN İNDİRİMİ TUTARI",{"$f":"F133+F128+F123+F118+F113+F108","v":26000},{"$f":"F132+F107+F112+F117+F122+F127","v":20000},{"$f":"F131+F106+F111+F116+F121+F126","v":6000},{"$f":"F130+F105+F110+F115+F120+F125","v":0}]
[null,"YARLANILAN 32/A İNDİRİMİ TUTARI",{"$f":"K108+K113+K118+K123+K128+K133","v":0},{"$f":"K107+K112+K122+K127+K132","v":0},{"$f":"K106+K111+K116+K121+K126+K131","v":0},{"$f":"K105++K110+K115+K120+K125+K130","v":0}]
[]
[null,"32/A UYGULANABİLECEK MATRAH (1.TEŞVİK BELGESİ)",{"$f":"C84","v":0},"KV MATRAHI","1 - 5 PUAN İNDİRİM OLMASAYDI HESAPLANAN KV TUTARI","1 -5 Puan İndirim Tutarı","1 - 5 Puan İndirim Sonrasında Hesaplanan KV Tutarı","32/A İndirimi Olmasaydı Ödenecek KV Tutarı","1 -5 Puan İndirim ve 32/A VİO Uygulandıktan Sonra Tatbik Edilecek KV Oranı","1 -5 Puan İndirim ve 32/A İndirimi Uygulandıktan Sonra Ödenecek  KV Tutarı","Yararlanılan Yatırıma Katkı Tutarı\n(32/A İnd. KV Nedeniyle Vazgeçilen Vergi Tutarı)","Ödenecek KV Tutarı"]
[null,"GENEL ORANA TABİ KISIM (DİĞER FAALİYETLER)",{"$f":"F93","v":0.23076923076923078},{"$f":"C104*C105","v":0},{"$f":"D105*$H$94","v":0},0,{"$f":"E105-F105","v":0},{"$f":"G105","v":0},{"$f":"($H$94)-(($H$94)*$C$82)","v":0.25},{"$f":"I105*D105","v":0},{"$f":"G105-J105","v":0},{"$f":"J108","v":0}]
[null,"1 PUAN İNDİRİMLİ ORANA TABİ KISIM  (İMALAT)",{"$f":"E93","v":0.46153846153846156},{"$f":"C104*C106","v":0},{"$f":"D106*$H$94","v":0},{"$f":"D106/100","v":0},{"$f":"E106-F106","v":0},{"$f":"G106","v":0},{"$f":"($H$94-0.01)-(($H$94-0.01)*$C$82)","v":0.24},{"$f":"I106*D106","v":0},{"$f":"G106-J106","v":0}]
[null,"5 PUAN İNDİRİMLİ ORANA TABİ KISIM  ( İHRACAT)",{"$f":"D93","v":0.30769230769230771},{"$f":"C104*C107","v":0},{"$f":"D107*$H$94","v":0},{"$f":"D107/20","v":0},{"$f":"E107-F107","v":0},0,{"$f":"($H$94-0.05)-(($H$94-0.05)*C82)","v":0.2},0,{"$f":"G107-J107","v":0}]
[null,"TOPLAM",{"$f":"SUM(C105:C107)","v":1},{"$f":"SUM(D105:D107)","v":0},0,{"$f":"SUM(F105:F107)","v":0},{"$f":"SUM(G105:G107)","v":0},{"$f":"SUM(H105:H107)","v":0},null,0,0]
[null,"32/A UYGULANABİLECEK MATRAH (2.TEŞVİK BELGESİ)",{"$f":"D84","v":0},"KV MATRAHI","1 - 5 PUAN İNDİRİM OLMASAYDI HESAPLANAN KV TUTARI","1 -5 Puan İndirim Tutarı","1 -5 Puan İndirim Sonrasında Hesaplanan KV Tutarı","32/A İndirimi Olmasaydı Ödenecek KV Tutarı","1 - 5 Puan İndirim ve 32/A VİO Uygulandıktan Sonra Tatbik Edilecek KV Oranı","1-5  Puan İndirim ve 32/A İndirimi Uygulandıktan Sonra Ödenecek  KV Tutarı","Yararlanılan Yatırıma Katkı Tutarı\n(32/A İnd. KV Nedeniyle Vazgeçilen Vergi Tutarı)","Ödenecek KV Tutarı"]
[null,"GENEL ORANA TABİ KISIM (DİĞER FAALİYETLER)",{"$f":"F93","v":0.23076923076923078},{"$f":"C109*C110","v":0},{"$f":"D110*$H$94","v":0},0,{"$f":"E110-F110","v":0},{"$f":"G110","v":0},{"$f":"($H$94)-(($H$94)*D82)","v":0.25},{"$f":"I110*D110","v":0},{"$f":"G110-J110","v":0},{"$f":"J113","v":0}]
[null,"1 PUAN İNDİRİMLİ ORANA TABİ KISIM  (İMALAT)",{"$f":"E93","v":0.46153846153846156},{"$f":"C109*C111","v":0},{"$f":"D111*$H$94","v":0},{"$f":"D111/100","v":0},{"$f":"E111-F111","v":0},{"$f":"G111","v":0},{"$f":"($H$94-0.01)-(($H$94-0.01)*D82)","v":0.24},{"$f":"I111*D111","v":0},{"$f":"G111-J111","v":0}]
[null,"5 PUAN İNDİRİMLİ ORANA TABİ KISIM  ( İHRACAT)",{"$f":"D93","v":0.30769230769230771},{"$f":"C109*C112","v":0},{"$f":"D112*$H$94","v":0},{"$f":"D112/20","v":0},{"$f":"E112-F112","v":0},0,{"$f":"($H$94-0.05)-(($H$94-0.05)*D82)","v":0.2},0,{"$f":"G112-J112","v":0}]
[null,"TOPLAM",{"$f":"SUM(C110:C112)","v":1},0,0,{"$f":"SUM(F110:F112)","v":0},{"$f":"SUM(G110:G112)","v":0},{"$f":"SUM(H110:H112)","v":0},null,{"$f":"SUM(J110:J112)","v":0},0]
[null,"32/A UYGULANABİLECEK MATRAH (3.TEŞVİK BELGESİ)",{"$f":"E84","v":0},"KV MATRAHI","1 - 5 PUAN İNDİRİM OLMASAYDI HESAPLANAN KV TUTARI","1-5 Puan İndirim Tutarı","1 - 5 Puan İndirim Sonrasında Hesaplanan KV Tutarı","32/A İndirimi Olmasaydı Ödenecek KV Tutarı","1 - 5 Puan İndirim ve 32/A VİO Uygulandıktan Sonra Tatbik Edilecek KV Oranı","1 -5 Puan İndirim ve 32/A İndirimi Uygulandıktan Sonra Ödenecek  KV Tutarı","Yararlanılan Yatırıma Katkı Tutarı\n(32/A İnd. KV Nedeniyle Vazgeçilen Vergi Tutarı)","Ödenecek KV Tutarı"]
[null,"GENEL ORANA TABİ KISIM (DİĞER FAALİYETLER)",{"$f":"F93","v":0.23076923076923078},{"$f":"C114*C115","v":0},{"$f":"D115*$H$94","v":0},0,{"$f":"E115-F115","v":0},{"$f":"G115","v":0},{"$f":"($H$94)-(($H$94)*E82)","v":0.25},{"$f":"I115*D115","v":0},{"$f":"G115-J115","v":0},{"$f":"J118","v":0}]
[null,"1 PUAN İNDİRİMLİ ORANA TABİ KISIM  (İMALAT)",{"$f":"E93","v":0.46153846153846156},{"$f":"C114*C116","v":0},{"$f":"D116*$H$94","v":0},{"$f":"D116/100","v":0},{"$f":"E116-F116","v":0},{"$f":"G116","v":0},{"$f":"($H$94-0.01)-(($H$94-0.01)*E82)","v":0.24},{"$f":"I116*D116","v":0},{"$f":"G116-J116","v":0}]
[null,"5 PUAN İNDİRİMLİ ORANA TABİ KISIM  ( İHRACAT)",{"$f":"D93","v":0.30769230769230771},{"$f":"C114*C117","v":0},{"$f":"D117*$H$94","v":0},{"$f":"D117/20","v":0},{"$f":"E117-F117","v":0},0,{"$f":"($H$94-0.05)-(($H$94-0.05)*E82)","v":0.2},0,{"$f":"G117-J117","v":0}]
[null,"TOPLAM",{"$f":"SUM(C115:C117)","v":1},0,0,{"$f":"SUM(F115:F117)","v":0},{"$f":"SUM(G115:G117)","v":0},{"$f":"SUM(H115:H117)","v":0},null,{"$f":"SUM(J115:J117)","v":0},0]
[null,"32/A UYGULANABİLECEK MATRAH (4. TEŞVİK BELGESİ)",{"$f":"F84","v":0},"KV MATRAHI","1 - 5 PUAN İNDİRİM OLMASAYDI HESAPLANAN KV TUTARI","1-5 Puan İndirim Tutarı","1 -5 Puan İndirim Sonrasında Hesaplanan KV Tutarı","32/A İndirimi Olmasaydı Ödenecek KV Tutarı","1- 5  Puan İndirim ve 32/A VİO Uygulandıktan Sonra Tatbik Edilecek KV Oranı","1-5 Puan İndirim ve 32/A İndirimi Uygulandıktan Sonra Ödenecek  KV Tutarı","Yararlanılan Yatırıma Katkı Tutarı\n(32/A İnd. KV Nedeniyle Vazgeçilen Vergi Tutarı)","Ödenecek KV Tutarı"]
[null,"GENEL ORANA TABİ KISIM (DİĞER FAALİYETLER)",{"$f":"F93","v":0.23076923076923078},{"$f":"C119*C120","v":0},{"$f":"D120*$H$94","v":0},0,{"$f":"E120-F120","v":0},{"$f":"G120","v":0},{"$f":"($H$94)-(($H$94)*F82)","v":0.25},{"$f":"I120*D120","v":0},{"$f":"G120-J120","v":0},{"$f":"J123","v":0}]
[null,"1 PUAN İNDİRİMLİ ORANA TABİ KISIM  (İMALAT)",{"$f":"E93","v":0.46153846153846156},{"$f":"C119*C121","v":0},{"$f":"D121*$H$94","v":0},{"$f":"D121/100","v":0},{"$f":"E121-F121","v":0},{"$f":"G121","v":0},{"$f":"($H$94-0.01)-(($H$94-0.01)*F82)","v":0.24},{"$f":"I121*D121","v":0},{"$f":"G121-J121","v":0}]
[null,"5 PUAN İNDİRİMLİ ORANA TABİ KISIM  ( İHRACAT)",{"$f":"D93","v":0.30769230769230771},{"$f":"C119*C122","v":0},{"$f":"D122*$H$94","v":0},{"$f":"D122/20","v":0},{"$f":"E122-F122","v":0},0,{"$f":"($H$94-0.05)-(($H$94-0.05)*F82)","v":0.2},0,{"$f":"G122-J122","v":0}]
[null,"TOPLAM",{"$f":"SUM(C120:C122)","v":1},0,0,{"$f":"SUM(F120:F122)","v":0},{"$f":"SUM(G120:G122)","v":0},{"$f":"SUM(H120:H122)","v":0},null,{"$f":"SUM(J120:J122)","v":0},0]
[null,"32/A UYGULANABİLECEK MATRAH (5.TEŞVİK BELGESİ)",{"$f":"G84","v":0},"KV MATRAHI","1 - 5 PUAN İNDİRİM OLMASAYDI HESAPLANAN KV TUTARI","1-5 Puan İndirim Tutarı","1 - 5 Puan İndirim Sonrasında Hesaplanan KV Tutarı","32/A İndirimi Olmasaydı Ödenecek KV Tutarı","1 -5 Puan İndirim ve 32/A VİO Uygulandıktan Sonra Tatbik Edilecek KV Oranı","1 - 5 Puan İndirim ve 32/A İndirimi Uygulandıktan Sonra Ödenecek  KV Tutarı","Yararlanılan Yatırıma Katkı Tutarı\n(32/A İnd. KV Nedeniyle Vazgeçilen Vergi Tutarı)","Ödenecek KV Tutarı"]
[null,"GENEL ORANA TABİ KISIM (DİĞER FAALİYETLER)",{"$f":"F93","v":0.23076923076923078},{"$f":"C124*C125","v":0},{"$f":"D125*$H$94","v":0},0,{"$f":"E125-F125","v":0},{"$f":"G125","v":0},{"$f":"($H$94)-(($H$94)*G82)","v":0.25},{"$f":"I125*D125","v":0},{"$f":"G125-J125","v":0},{"$f":"J128","v":0}]
[null,"1 PUAN İNDİRİMLİ ORANA TABİ KISIM  (İMALAT)",{"$f":"E93","v":0.46153846153846156},{"$f":"C124*C126","v":0},{"$f":"D126*$H$94","v":0},{"$f":"D126/100","v":0},{"$f":"E126-F126","v":0},{"$f":"G126","v":0},{"$f":"($H$94-0.01)-(($H$94-0.01)*G82)","v":0.24},{"$f":"I126*D126","v":0},{"$f":"G126-J126","v":0}]
[null,"5 PUAN İNDİRİMLİ ORANA TABİ KISIM  ( İHRACAT)",{"$f":"D93","v":0.30769230769230771},{"$f":"C124*C127","v":0},{"$f":"D127*$H$94","v":0},{"$f":"D127/20","v":0},{"$f":"E127-F127","v":0},0,{"$f":"($H$94-0.05)-(($H$94-0.05)*G82)","v":0.2},0,{"$f":"G127-J127","v":0}]
[null,"TOPLAM",{"$f":"SUM(C125:C127)","v":1},0,0,{"$f":"SUM(F125:F127)","v":0},{"$f":"SUM(G125:G127)","v":0},{"$f":"SUM(H125:H127)","v":0},null,{"$f":"SUM(J125:J127)","v":0},0]
[null,"32/A UYGULANAMAYACAK MATRAH",{"$f":"IF(C85<=0,0,C85)","v":1300000},"KV MATRAHI","1-5 PUAN İNDİRİM OLMASAYDI HESAPLANAN KV TUTARI","1-5 Puan İndirim Tutarı","1 -5 Puan İndirim Sonrasında Hesaplanan KV Tutarı","32/A İNDİRİMİ UYGULANMAZ",null,"1 Puan İndirim ve 32/A İndirimi Uygulandıktan Sonra Ödenecek  KV Tutarı","Yararlanılan Yatırıma Katkı Tutarı\n(32/A İnd. KV Nedeniyle Vazgeçilen Vergi Tutarı)","Ödenecek KV Tutarı"]
[null,"GENEL ORANA TABİ KISIM (DİĞER FAALİYETLER)",{"$f":"F93","v":0.23076923076923078},{"$f":"C129*C130","v":300000},{"$f":"D130*$H$94","v":75000},0,{"$f":"E130-F130","v":75000},null,null,{"$f":"G130","v":75000},{"$f":"G130-J130","v":0},{"$f":"J133","v":299000}]
[null,"1 PUAN İNDİRİMLİ ORANA TABİ KISIM  (İMALAT)",{"$f":"E93","v":0.46153846153846156},{"$f":"C131*C129","v":600000},{"$f":"D131*$H$94","v":150000},{"$f":"D131/100","v":6000},{"$f":"E131-F131","v":144000},null,null,{"$f":"G131","v":144000},{"$f":"G131-J131","v":0}]
[null,"5 PUAN İNDİRİMLİ ORANA TABİ KISIM  ( İHRACAT)",{"$f":"D93","v":0.30769230769230771},{"$f":"C132*C129","v":400000},{"$f":"D132*$H$94","v":100000},{"$f":"D132/20","v":20000},{"$f":"E132-F132","v":80000},null,null,80000,0]
[null,"TOPLAM",{"$f":"SUM(C130:C132)","v":1},{"$f":"SUM(D130:D132)","v":1300000},325000,{"$f":"SUM(F130:F132)","v":26000},{"$f":"SUM(G130:G132)","v":299000},null,null,299000,0]
[null,"TOPLAM KV MATRAHI VE ÖDENMESİ GEREKEN KV ",{"$f":"C104+C129+C109+C114+C119+C124","v":1300000},{"$f":"D108+D133+D113+D118+D123+D128","v":1300000},{"$f":"E108+E133+E113+E118+E123+E128","v":325000},{"$f":"F108+F133+F113+F118+F123+F128","v":26000},{"$f":"G108+G133+G113+G118+G123+G128","v":299000},null,null,{"$f":"J108+J133+J113+J118+J123+J128","v":299000},{"$f":"K133+K108+K113+K118+K123+K128","v":0},{"$f":"L105+L130+L110+L115+L120+L125","v":299000}]
[]
[null,"GEÇİCİ VERGİ BEYANNMESİNDE MATRAH BİLDİRİMİ BÖLÜMÜNDE DOLDURULACAK KISIMLAR VE TUTARLARI"]
[null,"32 A Madde Kapsamında İndirimli Kurumlar Vergisine (Geçici Vergiye) Tabi Matrah",{"$f":"C104+C109+C114+C119+C124","v":0},{"$f":"E108+E113+E118+E123+E128","v":0},"1-5 Puan Olmasaydı Hesaplan KV Tutarı"]
[null,null,null,{"$f":"G108+G113+G118+G123++G128","v":0},"1 -5 Puan İndirim Sonrasında Ödenecek KV Tutarı\n (32 A olmasaydı hesaplanacak Vergi)"]
[null,null,null,{"$f":"K108+K113+K118+K123+K128","v":0},"32/A İndirimi ile Vazgeçilen Vergi"]
[null,"32 A Madde Kapsamında İndirimli Kurumlar Vergisi(Geçici Vergi) Oranı",{"$f":"IFERROR(D140/C137,0)","v":0},{"$f":"L105+L110+L115+L120+L125","v":0},"32/A ya Tabi Matrah Üzerinden Ödenecek KV"]
[null,"32/7 Madde Kapsamında İndirimli Kurumlar Vergisine (Geçici Vergiye) Tabi Matrah  (İhracat)",{"$f":"D132","v":400000},{"$f":"E132","v":100000},"5 Puan Olmasaydı Hesaplan KV Tutarı"]
[null,null,null,{"$f":"F132","v":20000},"5 Puan İndirimin Vergi Etkisi "]
[null,"32/7 Madde Kapsamında İndirimli Kurumlar Vergisi (Geçici Vergi) Oranı",{"$f":"IFERROR(D143/C141,0)","v":0.2},{"$f":"G132","v":80000},"5 Puan İndirim Sonrasında Ödenecek KV Tutarı (İhracat)\n"]
[null,"32/8 Madde Kapsamında İndirimli Kurumlar Vergisine (Geçici Vergiye) Tabi Matrah  (Üretim)",{"$f":"D131","v":600000},{"$f":"E131","v":150000},"1 Puan Olmasaydı Hesaplan KV Tutarı"]
[null,null,null,{"$f":"F131","v":6000},"1 Puan İndirimin Vergi Etkisi "]
[null,"32/8 Madde Kapsamında İndirimli Kurumlar Vergisi (Geçici Vergi) Oranı",{"$f":"IFERROR(D146/C144,0)","v":0.24},{"$f":"G131","v":144000},"1 Puan İndirim Sonrasında Ödenecek KV Tutarı (Üretim)\n"]
[null,"Genel Orana Tabi Matrah (Diğer)",{"$f":"D130","v":300000},{"$f":"J130","v":75000},"Diğer Faalilyetlerden Elde Edilen Kazanç"]
[null,null,{"$f":"IFERROR(D147/C147,0)","v":0.25}]
[null,"MATRAHLAR TOPLAMI",{"$f":"C137+C144+C141+C147","v":1300000},{"$f":"D140+D146+D143+D147","v":299000}]

{"sheet":"İÜ Ö4","index":12,"n_rows":149,"n_cols":12,"rows_kept":149,"cut":false,"hidden":true,"merged":[[84,2,84,6],[1,1,2,1],[59,1,59,2],[60,1,60,2],[71,1,72,1],[73,1,73,2],[74,1,74,2],[74,3,74,4],[75,1,75,2],[75,3,75,4],[79,1,79,3],[82,2,82,6],[85,2,85,6],[87,1,89,1],[87,2,88,2],[87,3,88,3],[87,4,88,4],[87,5,88,5],[135,1,135,4],[137,1,138,2],[104,11,107,11],[109,11,112,11],[114,11,117,11],[119,11,122,11],[124,11,127,11],[128,7,133,8],[129,11,132,11]]}
[]
[null,"FAALİYET TÜRLERİ İTİBARİYLE HASILATLAR VE TOPLAM İÇİNDEKİ ORANLARI",{"$f":"IFERROR(C4/C4,0)","v":1},{"$f":"IFERROR(D4/C4,0)","v":0.8},{"$f":"IFERROR(E4/C4,0)","v":-0.1},{"$f":"IFERROR(F4/C4,0)","v":0.3}]
[null,null,"Toplam Hasılat","İhracat faaliyeti","İmalat faaliyeti","Diğer faaliyetler"]
[null,"A-BRÜT SATIŞLAR (60)",{"$f":"D4+E4+F4","v":1000000},{"$f":"SUM(D5:D7)","v":800000},{"$f":"SUM(E5:E7)","v":-100000},300000]
[null,"1-Yurtiçi Satışlar (600)",{"$f":"D5+E5+F5","v":-600000},null,-600000]
[null,"2-Yurtdışı Satışlar (601)",{"$f":"D6+E6+F6","v":0}]
[null,"3-Diğer Gelirler (602)",{"$f":"D7+E7+F7","v":1600000},800000,500000,300000]
[null,"B-SATIŞ İNDİRİMLERİ(-) (61)",{"$f":"SUM(C9:C11)","v":0},{"$f":"SUM(D9:D11)","v":0},{"$f":"SUM(E9:E11)","v":0},0]
[null,"1-Satıştan İadeler (-) (610)",{"$f":"SUM(D9:F9)","v":0}]
[null,"2- Satış İskontoları (-) (611)",{"$f":"SUM(D10:F10)","v":0}]
[null,"3-Diğer İndirimler (-) (612)",0]
[null,"C-NET SATIŞLAR",{"$f":"C4-C8","v":1000000},{"$f":"D4-D8","v":800000},{"$f":"E4-E8","v":-100000},300000]
[null,"D-SATIŞLARIN MALİYETİ (-) (62)",{"$f":"SUM(C14:C17)","v":0},{"$f":"SUM(D14:D17)","v":0},{"$f":"SUM(E14:E17)","v":0},{"$f":"SUM(F14:F17)","v":0}]
[null,"1-Satılan Mamuller Maliyeti ( 620)",{"$f":"SUM(D14:F14)","v":0}]
[null,"2-Satılan Ticari Mal Maliyeti (621)",{"$f":"SUM(D15:F15)","v":0}]
[null,"3-Satılan Hizmet Maliyeti (622)",0]
[null,"4-Diğer Satışların Maliyeti (623)",0]
[null,"BRÜT SATIŞ KARI / ZARARI",{"$f":"C12-C13","v":1000000},{"$f":"D12-D13","v":800000},{"$f":"E12-E13","v":-100000},300000]
[null,"E-FAALİYET GİDERLERİ (-) (63)",{"$f":"SUM(C20:C24)","v":0},{"$f":"SUM(D20:D24)","v":0},{"$f":"SUM(E20:E24)","v":0},0]
[null,"1-Araştırma ve Geliştirme Giderleri(-) (630)",{"$f":"SUM(D20:F20)","v":0}]
[null,"2-Pazarlama, Satış ve Dağıtım Giderleri(-) (631)",{"$f":"SUM(D21:F21)","v":0}]
[null,"3-Genel Yönetim Giderleri(-) (632)",{"$f":"SUM(D22:F22)","v":0}]
[null,"MÜŞTEREK GENEL GİDERLER (DAĞITIM-HASILAT PAYINA GÖRE)",null,{"$f":"C23*D2","v":0},{"$f":"C23*E2","v":0},{"$f":"C23*F2","v":0}]
[null,"MÜŞTEREK GENEL GİDER GİBİ DAĞITIMA TABİ TUTULACAK AMORTİSMAN GİDERLERİ  (DAĞITIM-HASILAT PAYINA GÖRE)",null,{"$f":"C24*D2","v":0},{"$f":"C24*E2","v":0},{"$f":"C24*F2","v":0}]
[null,"FAALİYET KARI / ZARARI ",{"$f":"C18-C19","v":1000000},{"$f":"D18-D19","v":800000},{"$f":"E18-E19","v":-100000},300000]
[null,"F-DİĞER FAALİYETLERDEN OLAĞAN GELİR VE KARLAR (64)",{"$f":"SUM(C27:C35)","v":0},{"$f":"SUM(D27:D35)","v":0},{"$f":"SUM(E27:E35)","v":0},{"$f":"SUM(F27:F35)","v":0}]
[null,"         1- İŞTİRAKLERDEN TEMETTÜ GELİRLERİ (640)",{"$f":"SUM(D27:F27)","v":0}]
[null,"         2- BAĞLI ORTAKLIKLARDAN TEMETTÜ GELİRLERİ (641)",{"$f":"SUM(D28:F28)","v":0}]
[null,"         3- FAİZ GELİRLERİ (642) (ihracat ve imalat kaynaklı alacağın tahsiline kadar olan süreçte oluşan)",0]
[null,"         4- KOMİSYON GELİRLERİ (643)",0]
[null,"         5- KONUSU OLMAYAN KARŞILIKLAR (644)",0]
[null,"         6- MENKUL KIYMET SATIŞ KARLARI (645)",0]
[null,"         7- KAMBİYO KARLARI (646) (ihracat ve imalat kaynaklı alacağın tahsiline kadar olan süreçte oluşan)",0]
[null,"         8- REESKONT FAİZ GELİRLERİ (647)",0]
[null,"         9- FAALİYETLE İLGİLİ DİĞER GELİR VE KARLAR (649)",0]
[null,"ARA TOPLAM",{"$f":"C25+C26","v":1000000},{"$f":"D25+D26","v":800000},{"$f":"E25+E26","v":-100000},{"$f":"F25+F26","v":300000}]
[null,"G-DİĞER FAALİYETLERDEN OLAĞAN GİDER VE ZARARLAR(-) (65)",{"$f":"SUM(C38:C43)","v":0},{"$f":"SUM(D38:D43)","v":0},{"$f":"SUM(E38:E43)","v":0},0]
[null,"         1- KOMİSYON GİDERLERİ (653)",{"$f":"SUM(D38:F38)","v":0}]
[null,"         2- KARŞILIK GİDERLERİ (654)",{"$f":"SUM(D39:F39)","v":0}]
[null,"         3- MENKUL KIYMET SATIŞ ZARARLARI (655)",0]
[null,"         4- KAMBİYO ZARARLARI (656) (ihracat ve imalat kaynaklı alacağın tahsiline kadar olan süreçte oluşan)",0]
[null,"         5- REESKONT FAİZ GİDERLERİ (657)",0]
[null,"         6- DİĞER OLAĞAN GİDER VE ZARARLAR (659)",{"$f":"SUM(D43:F43)","v":0}]
[null,"ARA TOPLAM",{"$f":"C36-C37","v":1000000},{"$f":"D36-D37","v":800000},{"$f":"E36-E37","v":-100000},300000]
[null,"H-FİNANSMAN GİDERLERİ(-) (66)",{"$f":"SUM(C46:C49)","v":0},{"$f":"SUM(D46:D49)","v":0},{"$f":"SUM(E46:E49)","v":0},{"$f":"SUM(F46:F49)","v":0}]
[null,"         1- KISA VADELİ BORÇLANMA GİDERLERİ (-)",{"$f":"SUM(D46:F46)","v":0}]
[null,"         2- UZUN VADELİ BORÇLANMA GİDERLERİ (-)",{"$f":"SUM(D47:F47)","v":0}]
[null,"         1- KISA VADELİ BORÇLANMA GİDERLERİ (-) (DAĞITIM)",null,{"$f":"C48*D2","v":0},{"$f":"C48*E2","v":0},{"$f":"C48*F2","v":0}]
[null,"         2- UZUN VADELİ BORÇLANMA GİDERLERİ (-) (DAĞITIM)",null,{"$f":"C49*D2","v":0},{"$f":"C49*E2","v":0},{"$f":"C49*F2","v":0}]
[null,"ARA TOPLAM",{"$f":"C44-C45","v":1000000},{"$f":"D44-D45","v":800000},{"$f":"E44-E45","v":-100000},{"$f":"F44-F45","v":300000}]
[null,"I-OLAĞANDIŞI GELİR VE KÂRLAR (67)",{"$f":"SUM(D51:F51)","v":0},{"$f":"SUM(D52:D53)","v":0},{"$f":"SUM(E52:E53)","v":0},{"$f":"SUM(F52:F53)","v":0}]
[null,"1- ÖNCEKİ DÖNEM GELİR VE KARLARI (671)",{"$f":"SUM(D52:F52)","v":0}]
[null,"2-DİĞER OLAĞAN DIŞI GELİR VE KARLAR (679)",{"$f":"SUM(D53:F53)","v":0}]
[null,"ARA TOPLAM",{"$f":"SUM(D54:F54)","v":1000000},{"$f":"D50+D51","v":800000},{"$f":"E50+E51","v":-100000},300000]
[null,"J-OLAĞANDIŞI GİDER VE ZARARLAR(-) (68)",{"$f":"SUM(C56:C58)","v":0},{"$f":"SUM(D56:D58)","v":0},{"$f":"SUM(E56:E58)","v":0},0]
[null,"1-Çalışmayan Kısım Gider ve Zararları(-) (680)",{"$f":"SUM(D56:F56)","v":0}]
[null,"2-Önceki Dönem Gider ve Zararları(-) (681)",{"$f":"SUM(D57:F57)","v":0}]
[null,"3-Diğer Olağan Dışı Gider ve Zararlar(-) (689)",0]
[null,"DÖNEM KÂRI VEYA ZARARI \n(TİCARİ BİLANÇO KARI ZARARI )",{"$f":"C54-C55","v":1000000},{"$f":"D54-D55","v":800000},{"$f":"E54-E55","v":-100000},300000]
[null,"İHRACAT, İMALAT VE DİĞER FAALİYETLERDEN ELDE EDİLEN KAZANCIN TOPLAM TİCARİ KAZANÇ İÇİNDEKİ PAYLARI  \n\n(Kazançlar arasında Öncelik İhracat Kazancına Verilmiştir. İhrcat Kazancından arta kalan Ticari Kazanç İmalat ve Diğer Faaliyetlere Sayılmıştır.)\n\n",null,{"$f":"IF(D59>=$C$59,1,\n    IF(D59<=0,0,\n    IF(AND(D59>0,D59<$C$59),D59/$C$59)))","v":0.8},{"$f":"IF(E59>=$C$59,1,\n    IF(E59<=0,0,\n    IF(AND(E59>0,E59<$C$59),E59/$C$59)))","v":0},{"$f":"IF(F59>=$C$59,1,\n    IF(F59<=0,0,\n    IF(AND(F59>0,F59<$C$59),F59/$C$59)))","v":0.3}]
[null,null,null,{"$f":"D60/(D60+E60+F60)","v":0.72727272727272729},{"$f":"E60/(D60+E60+F60)","v":0},{"$f":"F60/(D60+E60+F60)","v":0.27272727272727271}]
[]
[null,"KKEG +",200000]
[null," KABUL EDİLMEYEN GELİRLER -"]
[null,"ZARAR OLSA DAHİ İNDİRİLECEK İSTİSNALAR -",{"$f":"C66+C67+C68","v":0}]
[null,"Hizmet İhracatı Faaliyetinden (KVK 10-1/ğ) Elde Edilen Kazançlardan İstisna Edilenlerin Toplamı"]
[null,"İmalat Faaliyetinden Elde Edilen Kazançlardan İstisna Edilenlerin Toplamı"]
[null,"Diğer Faaliyetlerden Elde Edilen Kazançlardan İstisna Edilenlerin Toplamı"]
[null,"GEÇMİŞ YIL ZARARLARI -"]
[null,"İNDİRİMLER -",null,"AZAMİ YAZILABİLECEK İNDİRİMLER TUTARI",{"$f":"C59+C63-C64-C65-C69","v":1200000}]
[]
[null,"1 PUAN İNDİRİM UYGULANACAK TUTARIN HESABINDA İSTİSNA KAZANÇLAR DÜŞÜLDÜKTEN SONRA BULUNAN TİCARİ KAZANÇ TUTARI İLE  İHRACAT,İMALAT VE DİĞER KAZANÇLARIN TUTARI","TİCARİ KAZANÇ TAN İhracat ve İmalat Kazancından İstisna Olan Tutarlar Düşüldükten Sonra Kalan Tutarı","İhracat Faaliyetinden Elde Edilen  Kazançtan İstisna Olan Kısım Düşüldükten Sonra Bulunan Tutarı","Üretim  Faaliyetinden Elde Edilen  Kazançtan İstisna Olan Kısım Düşüldükten Sonra Bulunan Tutarı","Diğer Faaliyetinden Elde Edilen  Kazanç"]
[null,null,{"$f":"IF(C59-C66-C67<=0,0,C59-C66-C67)","v":1000000},{"$f":"IF($D$59-C66<=0,0,MIN($D$59-C66,$C$73*D61))","v":727272.72727272729},{"$f":"IF($E$59-C67<=0,0,MIN($E$59-C67,$C$73*E61))","v":0},{"$f":"IF(C73-D73-E73<=0,0,C73-D73-E73)","v":272727.27272727271}]
[null,"MATRAH DAĞITIM PAYLARI",null,{"$f":"IFERROR(IF(D73/C73<=0,0,D73/C73),0)","v":0.72727272727272729},{"$f":"IFERROR(IF(E73/C73<=0,0,E73/C73),0)","v":0},{"$f":"IFERROR(F73/C73,0)","v":0.27272727272727271}]
[null,"İHRACAT, İMALAT VE DİĞER FAALİYETLERDEN ELDE EDİLEN KAZANCIN TOPLAM TİCARİ KAZANÇ İÇİNDEKİ PAYLARI ",null,{"$f":"IFERROR(IF(AND(D73+E73>C73, F73<=0),1,(D73+E73)/C73),0)","v":0.72727272727272729},null,{"$f":"IFERROR(IF(F73<=0,0,F73/C73),0)","v":0.27272727272727271}]
[null,"NEGATİF VE % 100 DEN BÜYÜKLÜK KONTROLÜ SONRASINDAKİ PAYLARI",null,{"$f":"IFERROR(IF(D75<=0,0,IF(D75>1,1,D75)),0)","v":0.72727272727272729},null,{"$f":"IFERROR(IF(F75<=0,0,IF(F75>1,1,F75)),0)","v":0.27272727272727271}]
[]
[null,"SAFİ KURUM KAZANCI \n(KURUMLAR VERGİSİ MATRAHI)",{"$f":"C59+C63-C64-C65-C69-C70","v":1200000},{"$f":"IF(C78<0, \"ZARAR\",\"KAR\")","v":"KAR"}]
[]
[null,"2022 YILI 3. DÖNEM İNDİRİMLİ KURUMLAR VERGİSİ HESAPLAMA TABLOSU"]
[null,null,"1. TEŞVİK BELGESİ","2. TEŞVİK BELGESİ","3. TEŞVİK BELGESİ","4. TEŞVİK BELGESİ","5. TEŞVİK BELGESİ"]
[null,"Vergi İndirim Oranı (VİO)"]
[null,"KV MATRAHI (Safi Kurum Kazancı)",{"$f":"C78","v":1200000}]
[null,"32/A  Uygulanacak K.V. Matrahı (HER BİR TEŞVİK BELGESİ KAPSAMINDA YARARLANILABİLECEK YATIRIMA KATKI TUTARININ MATRAHI BU HÜCRELERE YAZILMALIDIR)",null,null,null,null,null,{"$f":"IF(SUM(C84:G84)>C78,\"32/A İNDİRİMİ UYGULANACAK KAZANÇ, SAFİ KURUM KAZANCINDAN FAZLADIR\",SUM(C84:G84))","v":0}]
[null,"32/A UYGULANMAYACAK K.V.  Matrahı",{"$f":"IF(C83-(C84+D84+E84+F84+G84)<0,0,C83-(C84+D84+E84+F84+G84))","v":1200000}]
[null,"MATRAH TOPLAMI",{"$f":"IF((C84+D84+E84+F84+G84+C85)>C78,C78,(C84+D84+E84+F84+G84+C85))","v":1200000}]
[]
[null,"SAFİ KURUM KAZANCININ  KV VERGİ ORANLARI İTİBARİYLE DAĞILIMI ","TOPLAM SAFİ KAZANÇ","İhracat Kazancı Payı","Üretim Kazancı Payı","Diğer Faaliyet Kazancı Payı"]
[]
[null,null,{"$f":"C78","v":1200000},{"$f":"IF(AND(AND($D$59>0,($D$59+$E$59)>=$C$59,D59>=C66),$C$90>=MAX(D59,D73)),\n\nMIN(MAX(IF(D59<=C90,D59,IF(D73<=C90,D73)),$C$90*D74)),\n\nIF(OR(D59<=0,D73<=0),0,\n\nMIN( MAX(   MAX(   IF(D59<=C90,D59),  IF(D73<=C90,D73) ),    MIN($C$90*D74,D59,D73)),$C$90)))","v":800000},{"$f":"MIN( IF(AND(AND($E$59>0,($D$59+$E$59)>=$C$59,E59>=C67),$C$90>=MAX(E59,E73)),\n\nMIN(MAX(IF(E59<=C90,E59,IF(E73<=C90,E73)),$C$90*E74)),\n\nIF(OR(E59<=0,E73<=0),0,\n\nMIN( MAX(   MAX(   IF(E59<=C90,E59),  IF(E73<=C90,E73) ),    MIN($C$90*E74,E59,E73)),$C$90))),C90-D90)","v":0},{"$f":"C90-D90-E90","v":400000}]
[null,"SAFİ KURUM KAZANCININ DAĞILIMI ORANSAL DAĞILIMI",{"$f":"C90","v":1200000},{"$f":"D90/C90","v":0.66666666666666663},{"$f":"E90/C90","v":0},{"$f":"F90/C90","v":0.33333333333333331}]
[null,"SAFİ KURUM KAZANCININ DAĞILIMI TUTARSAL",{"$f":"C91","v":1200000},{"$f":"D90","v":800000},{"$f":"E90","v":0},{"$f":"F90","v":400000}]
[null,"SAFİ KURUM KAZANCI DAĞILIMI",{"$f":"C92","v":1200000},{"$f":"IFERROR(IF(D92/C92>=1,1,D92/C92),0)","v":0.66666666666666663},{"$f":"IFERROR(IF(E92/C92>=1,1,E92/C92),0)","v":0},{"$f":"IFERROR(IF(F92/C92>=1,1,F92/C92),0)","v":0.33333333333333331},null,"KV ORANI"]
[null,"1 PUAN VE 32/A İNDİRİMİ OLMASAYDI HESAPLANAN KV TUTARI",{"$f":"C93*$H$94","v":300000},{"$f":"D92*$H$94","v":200000},{"$f":"E92*$H$94","v":0},{"$f":"F92*$H$94","v":100000},null,0.25]
[null,"32/ A UYGULANAN MATRAH",{"$f":"C84+D84+E84+F84+G84","v":0},{"$f":"D107+D112+D117+D122+D127","v":0},{"$f":"D106+D111+D116+D121+D126","v":0},{"$f":"D105+D110+D115+D120+D125","v":0}]
[null,"32/A UYGULANACAK MATRAH ÜZERİNDEN ÖDENECEK KV TUTARI",{"$f":"J108+J113+J118+J123+J128","v":0},{"$f":"J107+J112+J117+J122+J127","v":0},{"$f":"J106+J111+J116+J121+J126","v":0},{"$f":"J105+J110+J115+J120+J125","v":0}]
[null,"32/A UYGULANMAYAN MATRAH",{"$f":"IF(C85<=0,0,C85)","v":1200000},{"$f":"D132","v":800000},{"$f":"D131","v":0},{"$f":"D130","v":400000}]
[null,"32/A UYGULANMAYAN MATRAH ÜZERİNDEN ÖDENECEK KV TUTARI",{"$f":"L130","v":260000},{"$f":"J132","v":160000},{"$f":"J131","v":0},{"$f":"J130","v":100000}]
[null,"TOPLAM ÖDENECEK KV",{"$f":"C96+C98","v":260000},{"$f":"J132+J107","v":160000},{"$f":"J131+J106","v":0},{"$f":"J130+J105","v":100000}]
[null,"TOPLAM AVANTAJ  (YARARLANILAN 1 PUAN İNDİRİMİ + 32/A İNDİRİMİ TUTARI )",{"$f":"C94-C99","v":40000},{"$f":"D101+D102","v":40000},{"$f":"E101+E102","v":0},{"$f":"F101+F102","v":0}]
[null,"YARARLANILAN 1 - 5 PUAN İNDİRİMİ TUTARI",{"$f":"F133+F128+F123+F118+F113+F108","v":40000},{"$f":"F132+F107+F112+F117+F122+F127","v":40000},{"$f":"F131+F106+F111+F116+F121+F126","v":0},{"$f":"F130+F105+F110+F115+F120+F125","v":0}]
[null,"YARLANILAN 32/A İNDİRİMİ TUTARI",{"$f":"K108+K113+K118+K123+K128+K133","v":0},{"$f":"K107+K112+K122+K127+K132","v":0},{"$f":"K106+K111+K116+K121+K126+K131","v":0},{"$f":"K105++K110+K115+K120+K125+K130","v":0}]
[]
[null,"32/A UYGULANABİLECEK MATRAH (1.TEŞVİK BELGESİ)",{"$f":"C84","v":0},"KV MATRAHI","1 - 5 PUAN İNDİRİM OLMASAYDI HESAPLANAN KV TUTARI","1 -5 Puan İndirim Tutarı","1 - 5 Puan İndirim Sonrasında Hesaplanan KV Tutarı","32/A İndirimi Olmasaydı Ödenecek KV Tutarı","1 -5 Puan İndirim ve 32/A VİO Uygulandıktan Sonra Tatbik Edilecek KV Oranı","1 -5 Puan İndirim ve 32/A İndirimi Uygulandıktan Sonra Ödenecek  KV Tutarı","Yararlanılan Yatırıma Katkı Tutarı\n(32/A İnd. KV Nedeniyle Vazgeçilen Vergi Tutarı)","Ödenecek KV Tutarı"]
[null,"GENEL ORANA TABİ KISIM (DİĞER FAALİYETLER)",{"$f":"F93","v":0.33333333333333331},{"$f":"C104*C105","v":0},{"$f":"D105*$H$94","v":0},0,{"$f":"E105-F105","v":0},{"$f":"G105","v":0},{"$f":"($H$94)-(($H$94)*$C$82)","v":0.25},{"$f":"I105*D105","v":0},{"$f":"G105-J105","v":0},{"$f":"J108","v":0}]
[null,"1 PUAN İNDİRİMLİ ORANA TABİ KISIM  (İMALAT)",{"$f":"E93","v":0},{"$f":"C104*C106","v":0},{"$f":"D106*$H$94","v":0},{"$f":"D106/100","v":0},{"$f":"E106-F106","v":0},{"$f":"G106","v":0},{"$f":"($H$94-0.01)-(($H$94-0.01)*$C$82)","v":0.24},{"$f":"I106*D106","v":0},{"$f":"G106-J106","v":0}]
[null,"5 PUAN İNDİRİMLİ ORANA TABİ KISIM  ( İHRACAT)",{"$f":"D93","v":0.66666666666666663},{"$f":"C104*C107","v":0},{"$f":"D107*$H$94","v":0},{"$f":"D107/20","v":0},{"$f":"E107-F107","v":0},0,{"$f":"($H$94-0.05)-(($H$94-0.05)*C82)","v":0.2},0,{"$f":"G107-J107","v":0}]
[null,"TOPLAM",{"$f":"SUM(C105:C107)","v":1},{"$f":"SUM(D105:D107)","v":0},0,{"$f":"SUM(F105:F107)","v":0},{"$f":"SUM(G105:G107)","v":0},{"$f":"SUM(H105:H107)","v":0},null,0,0]
[null,"32/A UYGULANABİLECEK MATRAH (2.TEŞVİK BELGESİ)",{"$f":"D84","v":0},"KV MATRAHI","1 - 5 PUAN İNDİRİM OLMASAYDI HESAPLANAN KV TUTARI","1 -5 Puan İndirim Tutarı","1 -5 Puan İndirim Sonrasında Hesaplanan KV Tutarı","32/A İndirimi Olmasaydı Ödenecek KV Tutarı","1 - 5 Puan İndirim ve 32/A VİO Uygulandıktan Sonra Tatbik Edilecek KV Oranı","1-5  Puan İndirim ve 32/A İndirimi Uygulandıktan Sonra Ödenecek  KV Tutarı","Yararlanılan Yatırıma Katkı Tutarı\n(32/A İnd. KV Nedeniyle Vazgeçilen Vergi Tutarı)","Ödenecek KV Tutarı"]
[null,"GENEL ORANA TABİ KISIM (DİĞER FAALİYETLER)",{"$f":"F93","v":0.33333333333333331},{"$f":"C109*C110","v":0},{"$f":"D110*$H$94","v":0},0,{"$f":"E110-F110","v":0},{"$f":"G110","v":0},{"$f":"($H$94)-(($H$94)*D82)","v":0.25},{"$f":"I110*D110","v":0},{"$f":"G110-J110","v":0},{"$f":"J113","v":0}]
[null,"1 PUAN İNDİRİMLİ ORANA TABİ KISIM  (İMALAT)",{"$f":"E93","v":0},{"$f":"C109*C111","v":0},{"$f":"D111*$H$94","v":0},{"$f":"D111/100","v":0},{"$f":"E111-F111","v":0},{"$f":"G111","v":0},{"$f":"($H$94-0.01)-(($H$94-0.01)*D82)","v":0.24},{"$f":"I111*D111","v":0},{"$f":"G111-J111","v":0}]
[null,"5 PUAN İNDİRİMLİ ORANA TABİ KISIM  ( İHRACAT)",{"$f":"D93","v":0.66666666666666663},{"$f":"C109*C112","v":0},{"$f":"D112*$H$94","v":0},{"$f":"D112/20","v":0},{"$f":"E112-F112","v":0},0,{"$f":"($H$94-0.05)-(($H$94-0.05)*D82)","v":0.2},0,{"$f":"G112-J112","v":0}]
[null,"TOPLAM",{"$f":"SUM(C110:C112)","v":1},0,0,{"$f":"SUM(F110:F112)","v":0},{"$f":"SUM(G110:G112)","v":0},{"$f":"SUM(H110:H112)","v":0},null,{"$f":"SUM(J110:J112)","v":0},0]
[null,"32/A UYGULANABİLECEK MATRAH (3.TEŞVİK BELGESİ)",{"$f":"E84","v":0},"KV MATRAHI","1 - 5 PUAN İNDİRİM OLMASAYDI HESAPLANAN KV TUTARI","1-5 Puan İndirim Tutarı","1 - 5 Puan İndirim Sonrasında Hesaplanan KV Tutarı","32/A İndirimi Olmasaydı Ödenecek KV Tutarı","1 - 5 Puan İndirim ve 32/A VİO Uygulandıktan Sonra Tatbik Edilecek KV Oranı","1 -5 Puan İndirim ve 32/A İndirimi Uygulandıktan Sonra Ödenecek  KV Tutarı","Yararlanılan Yatırıma Katkı Tutarı\n(32/A İnd. KV Nedeniyle Vazgeçilen Vergi Tutarı)","Ödenecek KV Tutarı"]
[null,"GENEL ORANA TABİ KISIM (DİĞER FAALİYETLER)",{"$f":"F93","v":0.33333333333333331},{"$f":"C114*C115","v":0},{"$f":"D115*$H$94","v":0},0,{"$f":"E115-F115","v":0},{"$f":"G115","v":0},{"$f":"($H$94)-(($H$94)*E82)","v":0.25},{"$f":"I115*D115","v":0},{"$f":"G115-J115","v":0},{"$f":"J118","v":0}]
[null,"1 PUAN İNDİRİMLİ ORANA TABİ KISIM  (İMALAT)",{"$f":"E93","v":0},{"$f":"C114*C116","v":0},{"$f":"D116*$H$94","v":0},{"$f":"D116/100","v":0},{"$f":"E116-F116","v":0},{"$f":"G116","v":0},{"$f":"($H$94-0.01)-(($H$94-0.01)*E82)","v":0.24},{"$f":"I116*D116","v":0},{"$f":"G116-J116","v":0}]
[null,"5 PUAN İNDİRİMLİ ORANA TABİ KISIM  ( İHRACAT)",{"$f":"D93","v":0.66666666666666663},{"$f":"C114*C117","v":0},{"$f":"D117*$H$94","v":0},{"$f":"D117/20","v":0},{"$f":"E117-F117","v":0},0,{"$f":"($H$94-0.05)-(($H$94-0.05)*E82)","v":0.2},0,{"$f":"G117-J117","v":0}]
[null,"TOPLAM",{"$f":"SUM(C115:C117)","v":1},0,0,{"$f":"SUM(F115:F117)","v":0},{"$f":"SUM(G115:G117)","v":0},{"$f":"SUM(H115:H117)","v":0},null,{"$f":"SUM(J115:J117)","v":0},0]
[null,"32/A UYGULANABİLECEK MATRAH (4. TEŞVİK BELGESİ)",{"$f":"F84","v":0},"KV MATRAHI","1 - 5 PUAN İNDİRİM OLMASAYDI HESAPLANAN KV TUTARI","1-5 Puan İndirim Tutarı","1 -5 Puan İndirim Sonrasında Hesaplanan KV Tutarı","32/A İndirimi Olmasaydı Ödenecek KV Tutarı","1- 5  Puan İndirim ve 32/A VİO Uygulandıktan Sonra Tatbik Edilecek KV Oranı","1-5 Puan İndirim ve 32/A İndirimi Uygulandıktan Sonra Ödenecek  KV Tutarı","Yararlanılan Yatırıma Katkı Tutarı\n(32/A İnd. KV Nedeniyle Vazgeçilen Vergi Tutarı)","Ödenecek KV Tutarı"]
[null,"GENEL ORANA TABİ KISIM (DİĞER FAALİYETLER)",{"$f":"F93","v":0.33333333333333331},{"$f":"C119*C120","v":0},{"$f":"D120*$H$94","v":0},0,{"$f":"E120-F120","v":0},{"$f":"G120","v":0},{"$f":"($H$94)-(($H$94)*F82)","v":0.25},{"$f":"I120*D120","v":0},{"$f":"G120-J120","v":0},{"$f":"J123","v":0}]
[null,"1 PUAN İNDİRİMLİ ORANA TABİ KISIM  (İMALAT)",{"$f":"E93","v":0},{"$f":"C119*C121","v":0},{"$f":"D121*$H$94","v":0},{"$f":"D121/100","v":0},{"$f":"E121-F121","v":0},{"$f":"G121","v":0},{"$f":"($H$94-0.01)-(($H$94-0.01)*F82)","v":0.24},{"$f":"I121*D121","v":0},{"$f":"G121-J121","v":0}]
[null,"5 PUAN İNDİRİMLİ ORANA TABİ KISIM  ( İHRACAT)",{"$f":"D93","v":0.66666666666666663},{"$f":"C119*C122","v":0},{"$f":"D122*$H$94","v":0},{"$f":"D122/20","v":0},{"$f":"E122-F122","v":0},0,{"$f":"($H$94-0.05)-(($H$94-0.05)*F82)","v":0.2},0,{"$f":"G122-J122","v":0}]
[null,"TOPLAM",{"$f":"SUM(C120:C122)","v":1},0,0,{"$f":"SUM(F120:F122)","v":0},{"$f":"SUM(G120:G122)","v":0},{"$f":"SUM(H120:H122)","v":0},null,{"$f":"SUM(J120:J122)","v":0},0]
[null,"32/A UYGULANABİLECEK MATRAH (5.TEŞVİK BELGESİ)",{"$f":"G84","v":0},"KV MATRAHI","1 - 5 PUAN İNDİRİM OLMASAYDI HESAPLANAN KV TUTARI","1-5 Puan İndirim Tutarı","1 - 5 Puan İndirim Sonrasında Hesaplanan KV Tutarı","32/A İndirimi Olmasaydı Ödenecek KV Tutarı","1 -5 Puan İndirim ve 32/A VİO Uygulandıktan Sonra Tatbik Edilecek KV Oranı","1 - 5 Puan İndirim ve 32/A İndirimi Uygulandıktan Sonra Ödenecek  KV Tutarı","Yararlanılan Yatırıma Katkı Tutarı\n(32/A İnd. KV Nedeniyle Vazgeçilen Vergi Tutarı)","Ödenecek KV Tutarı"]
[null,"GENEL ORANA TABİ KISIM (DİĞER FAALİYETLER)",{"$f":"F93","v":0.33333333333333331},{"$f":"C124*C125","v":0},{"$f":"D125*$H$94","v":0},0,{"$f":"E125-F125","v":0},{"$f":"G125","v":0},{"$f":"($H$94)-(($H$94)*G82)","v":0.25},{"$f":"I125*D125","v":0},{"$f":"G125-J125","v":0},{"$f":"J128","v":0}]
[null,"1 PUAN İNDİRİMLİ ORANA TABİ KISIM  (İMALAT)",{"$f":"E93","v":0},{"$f":"C124*C126","v":0},{"$f":"D126*$H$94","v":0},{"$f":"D126/100","v":0},{"$f":"E126-F126","v":0},{"$f":"G126","v":0},{"$f":"($H$94-0.01)-(($H$94-0.01)*G82)","v":0.24},{"$f":"I126*D126","v":0},{"$f":"G126-J126","v":0}]
[null,"5 PUAN İNDİRİMLİ ORANA TABİ KISIM  ( İHRACAT)",{"$f":"D93","v":0.66666666666666663},{"$f":"C124*C127","v":0},{"$f":"D127*$H$94","v":0},{"$f":"D127/20","v":0},{"$f":"E127-F127","v":0},0,{"$f":"($H$94-0.05)-(($H$94-0.05)*G82)","v":0.2},0,{"$f":"G127-J127","v":0}]
[null,"TOPLAM",{"$f":"SUM(C125:C127)","v":1},0,0,{"$f":"SUM(F125:F127)","v":0},{"$f":"SUM(G125:G127)","v":0},{"$f":"SUM(H125:H127)","v":0},null,{"$f":"SUM(J125:J127)","v":0},0]
[null,"32/A UYGULANAMAYACAK MATRAH",{"$f":"IF(C85<=0,0,C85)","v":1200000},"KV MATRAHI","1-5 PUAN İNDİRİM OLMASAYDI HESAPLANAN KV TUTARI","1-5 Puan İndirim Tutarı","1 -5 Puan İndirim Sonrasında Hesaplanan KV Tutarı","32/A İNDİRİMİ UYGULANMAZ",null,"1 Puan İndirim ve 32/A İndirimi Uygulandıktan Sonra Ödenecek  KV Tutarı","Yararlanılan Yatırıma Katkı Tutarı\n(32/A İnd. KV Nedeniyle Vazgeçilen Vergi Tutarı)","Ödenecek KV Tutarı"]
[null,"GENEL ORANA TABİ KISIM (DİĞER FAALİYETLER)",{"$f":"F93","v":0.33333333333333331},{"$f":"C129*C130","v":400000},{"$f":"D130*$H$94","v":100000},0,{"$f":"E130-F130","v":100000},null,null,{"$f":"G130","v":100000},{"$f":"G130-J130","v":0},{"$f":"J133","v":260000}]
[null,"1 PUAN İNDİRİMLİ ORANA TABİ KISIM  (İMALAT)",{"$f":"E93","v":0},{"$f":"C131*C129","v":0},{"$f":"D131*$H$94","v":0},{"$f":"D131/100","v":0},{"$f":"E131-F131","v":0},null,null,{"$f":"G131","v":0},{"$f":"G131-J131","v":0}]
[null,"5 PUAN İNDİRİMLİ ORANA TABİ KISIM  ( İHRACAT)",{"$f":"D93","v":0.66666666666666663},{"$f":"C132*C129","v":800000},{"$f":"D132*$H$94","v":200000},{"$f":"D132/20","v":40000},{"$f":"E132-F132","v":160000},null,null,160000,0]
[null,"TOPLAM",{"$f":"SUM(C130:C132)","v":1},{"$f":"SUM(D130:D132)","v":1200000},300000,{"$f":"SUM(F130:F132)","v":40000},{"$f":"SUM(G130:G132)","v":260000},null,null,260000,0]
[null,"TOPLAM KV MATRAHI VE ÖDENMESİ GEREKEN KV ",{"$f":"C104+C129+C109+C114+C119+C124","v":1200000},{"$f":"D108+D133+D113+D118+D123+D128","v":1200000},{"$f":"E108+E133+E113+E118+E123+E128","v":300000},{"$f":"F108+F133+F113+F118+F123+F128","v":40000},{"$f":"G108+G133+G113+G118+G123+G128","v":260000},null,null,{"$f":"J108+J133+J113+J118+J123+J128","v":260000},{"$f":"K133+K108+K113+K118+K123+K128","v":0},{"$f":"L105+L130+L110+L115+L120+L125","v":260000}]
[]
[null,"GEÇİCİ VERGİ BEYANNMESİNDE MATRAH BİLDİRİMİ BÖLÜMÜNDE DOLDURULACAK KISIMLAR VE TUTARLARI"]
[null,"32 A Madde Kapsamında İndirimli Kurumlar Vergisine (Geçici Vergiye) Tabi Matrah",{"$f":"C104+C109+C114+C119+C124","v":0},{"$f":"E108+E113+E118+E123+E128","v":0},"1-5 Puan Olmasaydı Hesaplan KV Tutarı"]
[null,null,null,{"$f":"G108+G113+G118+G123++G128","v":0},"1 -5 Puan İndirim Sonrasında Ödenecek KV Tutarı\n (32 A olmasaydı hesaplanacak Vergi)"]
[null,null,null,{"$f":"K108+K113+K118+K123+K128","v":0},"32/A İndirimi ile Vazgeçilen Vergi"]
[null,"32 A Madde Kapsamında İndirimli Kurumlar Vergisi(Geçici Vergi) Oranı",{"$f":"IFERROR(D140/C137,0)","v":0},{"$f":"L105+L110+L115+L120+L125","v":0},"32/A ya Tabi Matrah Üzerinden Ödenecek KV"]
[null,"32/7 Madde Kapsamında İndirimli Kurumlar Vergisine (Geçici Vergiye) Tabi Matrah  (İhracat)",{"$f":"D132","v":800000},{"$f":"E132","v":200000},"5 Puan Olmasaydı Hesaplan KV Tutarı"]
[null,null,null,{"$f":"F132","v":40000},"5 Puan İndirimin Vergi Etkisi "]
[null,"32/7 Madde Kapsamında İndirimli Kurumlar Vergisi (Geçici Vergi) Oranı",{"$f":"IFERROR(D143/C141,0)","v":0.2},{"$f":"G132","v":160000},"5 Puan İndirim Sonrasında Ödenecek KV Tutarı (İhracat)\n"]
[null,"32/8 Madde Kapsamında İndirimli Kurumlar Vergisine (Geçici Vergiye) Tabi Matrah  (Üretim)",{"$f":"D131","v":0},{"$f":"E131","v":0},"1 Puan Olmasaydı Hesaplan KV Tutarı"]
[null,null,null,{"$f":"F131","v":0},"1 Puan İndirimin Vergi Etkisi "]
[null,"32/8 Madde Kapsamında İndirimli Kurumlar Vergisi (Geçici Vergi) Oranı",{"$f":"IFERROR(D146/C144,0)","v":0},{"$f":"G131","v":0},"1 Puan İndirim Sonrasında Ödenecek KV Tutarı (Üretim)\n"]
[null,"Genel Orana Tabi Matrah (Diğer)",{"$f":"D130","v":400000},{"$f":"J130","v":100000},"Diğer Faalilyetlerden Elde Edilen Kazanç"]
[null,null,{"$f":"IFERROR(D147/C147,0)","v":0.25}]
[null,"MATRAHLAR TOPLAMI",{"$f":"C137+C144+C141+C147","v":1200000},{"$f":"D140+D146+D143+D147","v":260000}]

{"sheet":"32-1-2-8 Ö","index":13,"n_rows":149,"n_cols":12,"rows_kept":149,"cut":false,"hidden":true,"merged":[[84,2,84,6],[1,1,2,1],[59,1,59,2],[60,1,60,2],[71,1,72,1],[73,1,73,2],[74,1,74,2],[74,3,74,4],[75,1,75,2],[75,3,75,4],[79,1,79,3],[82,2,82,6],[85,2,85,6],[87,1,89,1],[87,2,88,2],[87,3,88,3],[87,4,88,4],[87,5,88,5],[135,1,135,4],[137,1,138,2],[104,11,107,11],[109,11,112,11],[114,11,117,11],[119,11,122,11],[124,11,127,11],[128,7,133,8],[129,11,132,11]]}
[]
[null,"FAALİYET TÜRLERİ İTİBARİYLE HASILATLAR VE TOPLAM İÇİNDEKİ ORANLARI",{"$f":"IFERROR(C4/C4,0)","v":1},{"$f":"IFERROR(D4/C4,0)","v":0.5},{"$f":"IFERROR(E4/C4,0)","v":0.75},{"$f":"IFERROR(F4/C4,0)","v":-0.25}]
[null,null,"Toplam Hasılat","İhracat faaliyeti","İmalat faaliyeti","Diğer faaliyetler"]
[null,"A-BRÜT SATIŞLAR (60)",{"$f":"D4+E4+F4","v":2000000},{"$f":"SUM(D5:D7)","v":1000000},{"$f":"SUM(E5:E7)","v":1500000},-500000]
[null,"1-Yurtiçi Satışlar (600)",{"$f":"D5+E5+F5","v":1000000},null,1500000,-500000]
[null,"2-Yurtdışı Satışlar (601)",{"$f":"D6+E6+F6","v":1000000},1000000]
[null,"3-Diğer Gelirler (602)",{"$f":"D7+E7+F7","v":0}]
[null,"B-SATIŞ İNDİRİMLERİ(-) (61)",{"$f":"SUM(C9:C11)","v":0},{"$f":"SUM(D9:D11)","v":0},{"$f":"SUM(E9:E11)","v":0},0]
[null,"1-Satıştan İadeler (-) (610)",{"$f":"SUM(D9:F9)","v":0}]
[null,"2- Satış İskontoları (-) (611)",{"$f":"SUM(D10:F10)","v":0}]
[null,"3-Diğer İndirimler (-) (612)",0]
[null,"C-NET SATIŞLAR",{"$f":"C4-C8","v":2000000},{"$f":"D4-D8","v":1000000},{"$f":"E4-E8","v":1500000},-500000]
[null,"D-SATIŞLARIN MALİYETİ (-) (62)",{"$f":"SUM(C14:C17)","v":0},{"$f":"SUM(D14:D17)","v":0},{"$f":"SUM(E14:E17)","v":0},{"$f":"SUM(F14:F17)","v":0}]
[null,"1-Satılan Mamuller Maliyeti ( 620)",{"$f":"SUM(D14:F14)","v":0}]
[null,"2-Satılan Ticari Mal Maliyeti (621)",{"$f":"SUM(D15:F15)","v":0}]
[null,"3-Satılan Hizmet Maliyeti (622)",0]
[null,"4-Diğer Satışların Maliyeti (623)",0]
[null,"BRÜT SATIŞ KARI / ZARARI",{"$f":"C12-C13","v":2000000},{"$f":"D12-D13","v":1000000},{"$f":"E12-E13","v":1500000},-500000]
[null,"E-FAALİYET GİDERLERİ (-) (63)",{"$f":"SUM(C20:C24)","v":0},{"$f":"SUM(D20:D24)","v":0},{"$f":"SUM(E20:E24)","v":0},0]
[null,"1-Araştırma ve Geliştirme Giderleri(-) (630)",{"$f":"SUM(D20:F20)","v":0}]
[null,"2-Pazarlama, Satış ve Dağıtım Giderleri(-) (631)",{"$f":"SUM(D21:F21)","v":0}]
[null,"3-Genel Yönetim Giderleri(-) (632)",{"$f":"SUM(D22:F22)","v":0}]
[null,"MÜŞTEREK GENEL GİDERLER (DAĞITIM-HASILAT PAYINA GÖRE)",null,{"$f":"C23*D2","v":0},{"$f":"C23*E2","v":0},{"$f":"C23*F2","v":0}]
[null,"MÜŞTEREK GENEL GİDER GİBİ DAĞITIMA TABİ TUTULACAK AMORTİSMAN GİDERLERİ  (DAĞITIM-HASILAT PAYINA GÖRE)",null,{"$f":"C24*D2","v":0},{"$f":"C24*E2","v":0},{"$f":"C24*F2","v":0}]
[null,"FAALİYET KARI / ZARARI ",{"$f":"C18-C19","v":2000000},{"$f":"D18-D19","v":1000000},{"$f":"E18-E19","v":1500000},-500000]
[null,"F-DİĞER FAALİYETLERDEN OLAĞAN GELİR VE KARLAR (64)",{"$f":"SUM(C27:C35)","v":0},{"$f":"SUM(D27:D35)","v":0},{"$f":"SUM(E27:E35)","v":0},{"$f":"SUM(F27:F35)","v":0}]
[null,"         1- İŞTİRAKLERDEN TEMETTÜ GELİRLERİ (640)",{"$f":"SUM(D27:F27)","v":0}]
[null,"         2- BAĞLI ORTAKLIKLARDAN TEMETTÜ GELİRLERİ (641)",{"$f":"SUM(D28:F28)","v":0}]
[null,"         3- FAİZ GELİRLERİ (642) (ihracat ve imalat kaynaklı alacağın tahsiline kadar olan süreçte oluşan)",0]
[null,"         4- KOMİSYON GELİRLERİ (643)",0]
[null,"         5- KONUSU OLMAYAN KARŞILIKLAR (644)",0]
[null,"         6- MENKUL KIYMET SATIŞ KARLARI (645)",0]
[null,"         7- KAMBİYO KARLARI (646) (ihracat ve imalat kaynaklı alacağın tahsiline kadar olan süreçte oluşan)",0]
[null,"         8- REESKONT FAİZ GELİRLERİ (647)",0]
[null,"         9- FAALİYETLE İLGİLİ DİĞER GELİR VE KARLAR (649)",0]
[null,"ARA TOPLAM",{"$f":"C25+C26","v":2000000},{"$f":"D25+D26","v":1000000},{"$f":"E25+E26","v":1500000},{"$f":"F25+F26","v":-500000}]
[null,"G-DİĞER FAALİYETLERDEN OLAĞAN GİDER VE ZARARLAR(-) (65)",{"$f":"SUM(C38:C43)","v":0},{"$f":"SUM(D38:D43)","v":0},{"$f":"SUM(E38:E43)","v":0},0]
[null,"         1- KOMİSYON GİDERLERİ (653)",{"$f":"SUM(D38:F38)","v":0}]
[null,"         2- KARŞILIK GİDERLERİ (654)",{"$f":"SUM(D39:F39)","v":0}]
[null,"         3- MENKUL KIYMET SATIŞ ZARARLARI (655)",0]
[null,"         4- KAMBİYO ZARARLARI (656) (ihracat ve imalat kaynaklı alacağın tahsiline kadar olan süreçte oluşan)",0]
[null,"         5- REESKONT FAİZ GİDERLERİ (657)",0]
[null,"         6- DİĞER OLAĞAN GİDER VE ZARARLAR (659)",{"$f":"SUM(D43:F43)","v":0}]
[null,"ARA TOPLAM",{"$f":"C36-C37","v":2000000},{"$f":"D36-D37","v":1000000},{"$f":"E36-E37","v":1500000},-500000]
[null,"H-FİNANSMAN GİDERLERİ(-) (66)",{"$f":"SUM(C46:C49)","v":0},{"$f":"SUM(D46:D49)","v":0},{"$f":"SUM(E46:E49)","v":0},{"$f":"SUM(F46:F49)","v":0}]
[null,"         1- KISA VADELİ BORÇLANMA GİDERLERİ (-)",{"$f":"SUM(D46:F46)","v":0}]
[null,"         2- UZUN VADELİ BORÇLANMA GİDERLERİ (-)",{"$f":"SUM(D47:F47)","v":0}]
[null,"         1- KISA VADELİ BORÇLANMA GİDERLERİ (-) (DAĞITIM)",null,{"$f":"C48*D2","v":0},{"$f":"C48*E2","v":0},{"$f":"C48*F2","v":0}]
[null,"         2- UZUN VADELİ BORÇLANMA GİDERLERİ (-) (DAĞITIM)",null,{"$f":"C49*D2","v":0},{"$f":"C49*E2","v":0},{"$f":"C49*F2","v":0}]
[null,"ARA TOPLAM",{"$f":"C44-C45","v":2000000},{"$f":"D44-D45","v":1000000},{"$f":"E44-E45","v":1500000},{"$f":"F44-F45","v":-500000}]
[null,"I-OLAĞANDIŞI GELİR VE KÂRLAR (67)",{"$f":"SUM(D51:F51)","v":0},{"$f":"SUM(D52:D53)","v":0},{"$f":"SUM(E52:E53)","v":0},{"$f":"SUM(F52:F53)","v":0}]
[null,"1- ÖNCEKİ DÖNEM GELİR VE KARLARI (671)",{"$f":"SUM(D52:F52)","v":0}]
[null,"2-DİĞER OLAĞAN DIŞI GELİR VE KARLAR (679)",{"$f":"SUM(D53:F53)","v":0}]
[null,"ARA TOPLAM",{"$f":"SUM(D54:F54)","v":2000000},{"$f":"D50+D51","v":1000000},{"$f":"E50+E51","v":1500000},-500000]
[null,"J-OLAĞANDIŞI GİDER VE ZARARLAR(-) (68)",{"$f":"SUM(C56:C58)","v":0},{"$f":"SUM(D56:D58)","v":0},{"$f":"SUM(E56:E58)","v":0},0]
[null,"1-Çalışmayan Kısım Gider ve Zararları(-) (680)",{"$f":"SUM(D56:F56)","v":0}]
[null,"2-Önceki Dönem Gider ve Zararları(-) (681)",{"$f":"SUM(D57:F57)","v":0}]
[null,"3-Diğer Olağan Dışı Gider ve Zararlar(-) (689)",0]
[null,"DÖNEM KÂRI VEYA ZARARI \n(TİCARİ BİLANÇO KARI ZARARI )",{"$f":"C54-C55","v":2000000},{"$f":"D54-D55","v":1000000},{"$f":"E54-E55","v":1500000},-500000]
[null,"İHRACAT, İMALAT VE DİĞER FAALİYETLERDEN ELDE EDİLEN KAZANCIN TOPLAM TİCARİ KAZANÇ İÇİNDEKİ PAYLARI  \n\n(Kazançlar arasında Öncelik İhracat Kazancına Verilmiştir. İhrcat Kazancından arta kalan Ticari Kazanç İmalat ve Diğer Faaliyetlere Sayılmıştır.)\n\n",null,{"$f":"IF(D59>=$C$59,1,\n    IF(D59<=0,0,\n    IF(AND(D59>0,D59<$C$59),D59/$C$59)))","v":0.5},{"$f":"IF(E59>=$C$59,1,\n    IF(E59<=0,0,\n    IF(AND(E59>0,E59<$C$59),E59/$C$59)))","v":0.75},{"$f":"IF(F59>=$C$59,1,\n    IF(F59<=0,0,\n    IF(AND(F59>0,F59<$C$59),F59/$C$59)))","v":0}]
[null,null,null,{"$f":"D60/(D60+E60+F60)","v":0.4},{"$f":"E60/(D60+E60+F60)","v":0.6},{"$f":"F60/(D60+E60+F60)","v":0}]
[]
[null,"KKEG +",700000]
[null," KABUL EDİLMEYEN GELİRLER -"]
[null,"ZARAR OLSA DAHİ İNDİRİLECEK İSTİSNALAR -",{"$f":"C66+C67+C68","v":0}]
[null,"Hizmet İhracatı Faaliyetinden (KVK 10-1/ğ) Elde Edilen Kazançlardan İstisna Edilenlerin Toplamı"]
[null,"İmalat Faaliyetinden Elde Edilen Kazançlardan İstisna Edilenlerin Toplamı"]
[null,"Diğer Faaliyetlerden Elde Edilen Kazançlardan İstisna Edilenlerin Toplamı"]
[null,"GEÇMİŞ YIL ZARARLARI -"]
[null,"İNDİRİMLER -",null,"AZAMİ YAZILABİLECEK İNDİRİMLER TUTARI",{"$f":"C59+C63-C64-C65-C69","v":2700000}]
[]
[null,"1 PUAN İNDİRİM UYGULANACAK TUTARIN HESABINDA İSTİSNA KAZANÇLAR DÜŞÜLDÜKTEN SONRA BULUNAN TİCARİ KAZANÇ TUTARI İLE  İHRACAT,İMALAT VE DİĞER KAZANÇLARIN TUTARI","TİCARİ KAZANÇ TAN İhracat ve İmalat Kazancından İstisna Olan Tutarlar Düşüldükten Sonra Kalan Tutarı","İhracat Faaliyetinden Elde Edilen  Kazançtan İstisna Olan Kısım Düşüldükten Sonra Bulunan Tutarı","Üretim  Faaliyetinden Elde Edilen  Kazançtan İstisna Olan Kısım Düşüldükten Sonra Bulunan Tutarı","Diğer Faaliyetinden Elde Edilen  Kazanç"]
[null,null,{"$f":"IF(C59-C66-C67<=0,0,C59-C66-C67)","v":2000000},{"$f":"IF($D$59-C66<=0,0,MIN($D$59-C66,$C$73*D61))","v":800000},{"$f":"IF($E$59-C67<=0,0,MIN($E$59-C67,$C$73*E61))","v":1200000},{"$f":"IF(C73-D73-E73<=0,0,C73-D73-E73)","v":0}]
[null,"MATRAH DAĞITIM PAYLARI",null,{"$f":"IFERROR(IF(D73/C73<=0,0,D73/C73),0)","v":0.4},{"$f":"IFERROR(IF(E73/C73<=0,0,E73/C73),0)","v":0.6},{"$f":"IFERROR(F73/C73,0)","v":0}]
[null,"İHRACAT, İMALAT VE DİĞER FAALİYETLERDEN ELDE EDİLEN KAZANCIN TOPLAM TİCARİ KAZANÇ İÇİNDEKİ PAYLARI ",null,{"$f":"IFERROR(IF(AND(D73+E73>C73, F73<=0),1,(D73+E73)/C73),0)","v":1},null,{"$f":"IFERROR(IF(F73<=0,0,F73/C73),0)","v":0}]
[null,"NEGATİF VE % 100 DEN BÜYÜKLÜK KONTROLÜ SONRASINDAKİ PAYLARI",null,{"$f":"IFERROR(IF(D75<=0,0,IF(D75>1,1,D75)),0)","v":1},null,{"$f":"IFERROR(IF(F75<=0,0,IF(F75>1,1,F75)),0)","v":0}]
[]
[null,"SAFİ KURUM KAZANCI \n(KURUMLAR VERGİSİ MATRAHI)",{"$f":"C59+C63-C64-C65-C69-C70","v":2700000},{"$f":"IF(C78<0, \"ZARAR\",\"KAR\")","v":"KAR"}]
[]
[null,"2022 YILI 3. DÖNEM İNDİRİMLİ KURUMLAR VERGİSİ HESAPLAMA TABLOSU"]
[null,null,"1. TEŞVİK BELGESİ","2. TEŞVİK BELGESİ","3. TEŞVİK BELGESİ","4. TEŞVİK BELGESİ","5. TEŞVİK BELGESİ"]
[null,"Vergi İndirim Oranı (VİO)"]
[null,"KV MATRAHI (Safi Kurum Kazancı)",{"$f":"C78","v":2700000}]
[null,"32/A  Uygulanacak K.V. Matrahı (HER BİR TEŞVİK BELGESİ KAPSAMINDA YARARLANILABİLECEK YATIRIMA KATKI TUTARININ MATRAHI BU HÜCRELERE YAZILMALIDIR)",null,null,null,null,null,{"$f":"IF(SUM(C84:G84)>C78,\"32/A İNDİRİMİ UYGULANACAK KAZANÇ, SAFİ KURUM KAZANCINDAN FAZLADIR\",SUM(C84:G84))","v":0}]
[null,"32/A UYGULANMAYACAK K.V.  Matrahı",{"$f":"IF(C83-(C84+D84+E84+F84+G84)<0,0,C83-(C84+D84+E84+F84+G84))","v":2700000}]
[null,"MATRAH TOPLAMI",{"$f":"IF((C84+D84+E84+F84+G84+C85)>C78,C78,(C84+D84+E84+F84+G84+C85))","v":2700000}]
[]
[null,"SAFİ KURUM KAZANCININ  KV VERGİ ORANLARI İTİBARİYLE DAĞILIMI ","TOPLAM SAFİ KAZANÇ","İhracat Kazancı Payı","Üretim Kazancı Payı","Diğer Faaliyet Kazancı Payı"]
[]
[null,null,{"$f":"C78","v":2700000},{"$f":"IF(AND(AND($D$59>0,($D$59+$E$59)>=$C$59,D59>=C66),$C$90>=MAX(D59,D73)),\n\nMIN(MAX(IF(D59<=C90,D59,IF(D73<=C90,D73)),$C$90*D74)),\n\nIF(OR(D59<=0,D73<=0),0,\n\nMIN( MAX(   MAX(   IF(D59<=C90,D59),  IF(D73<=C90,D73) ),    MIN($C$90*D74,D59,D73)),$C$90)))","v":1080000},{"$f":"MIN( IF(AND(AND($E$59>0,($D$59+$E$59)>=$C$59,E59>=C67),$C$90>=MAX(E59,E73)),\n\nMIN(MAX(IF(E59<=C90,E59,IF(E73<=C90,E73)),$C$90*E74)),\n\nIF(OR(E59<=0,E73<=0),0,\n\nMIN( MAX(   MAX(   IF(E59<=C90,E59),  IF(E73<=C90,E73) ),    MIN($C$90*E74,E59,E73)),$C$90))),C90-D90)","v":1620000},{"$f":"C90-D90-E90","v":0}]
[null,"SAFİ KURUM KAZANCININ DAĞILIMI ORANSAL DAĞILIMI",{"$f":"C90","v":2700000},{"$f":"D90/C90","v":0.4},{"$f":"E90/C90","v":0.6},{"$f":"F90/C90","v":0}]
[null,"SAFİ KURUM KAZANCININ DAĞILIMI TUTARSAL",{"$f":"C91","v":2700000},{"$f":"D90","v":1080000},{"$f":"E90","v":1620000},{"$f":"F90","v":0}]
[null,"SAFİ KURUM KAZANCI DAĞILIMI",{"$f":"C92","v":2700000},{"$f":"IFERROR(IF(D92/C92>=1,1,D92/C92),0)","v":0.4},{"$f":"IFERROR(IF(E92/C92>=1,1,E92/C92),0)","v":0.6},{"$f":"IFERROR(IF(F92/C92>=1,1,F92/C92),0)","v":0},null,"KV ORANI"]
[null,"1 PUAN VE 32/A İNDİRİMİ OLMASAYDI HESAPLANAN KV TUTARI",{"$f":"C93*$H$94","v":675000},{"$f":"D92*$H$94","v":270000},{"$f":"E92*$H$94","v":405000},{"$f":"F92*$H$94","v":0},null,0.25]
[null,"32/ A UYGULANAN MATRAH",{"$f":"C84+D84+E84+F84+G84","v":0},{"$f":"D107+D112+D117+D122+D127","v":0},{"$f":"D106+D111+D116+D121+D126","v":0},{"$f":"D105+D110+D115+D120+D125","v":0}]
[null,"32/A UYGULANACAK MATRAH ÜZERİNDEN ÖDENECEK KV TUTARI",{"$f":"J108+J113+J118+J123+J128","v":0},{"$f":"J107+J112+J117+J122+J127","v":0},{"$f":"J106+J111+J116+J121+J126","v":0},{"$f":"J105+J110+J115+J120+J125","v":0}]
[null,"32/A UYGULANMAYAN MATRAH",{"$f":"IF(C85<=0,0,C85)","v":2700000},{"$f":"D132","v":1080000},{"$f":"D131","v":1620000},{"$f":"D130","v":0}]
[null,"32/A UYGULANMAYAN MATRAH ÜZERİNDEN ÖDENECEK KV TUTARI",{"$f":"L130","v":604800},{"$f":"J132","v":216000},{"$f":"J131","v":388800},{"$f":"J130","v":0}]
[null,"TOPLAM ÖDENECEK KV",{"$f":"C96+C98","v":604800},{"$f":"J132+J107","v":216000},{"$f":"J131+J106","v":388800},{"$f":"J130+J105","v":0}]
[null,"TOPLAM AVANTAJ  (YARARLANILAN 1 PUAN İNDİRİMİ + 32/A İNDİRİMİ TUTARI )",{"$f":"C94-C99","v":70200},{"$f":"D101+D102","v":54000},{"$f":"E101+E102","v":16200},{"$f":"F101+F102","v":0}]
[null,"YARARLANILAN 1 - 5 PUAN İNDİRİMİ TUTARI",{"$f":"F133+F128+F123+F118+F113+F108","v":70200},{"$f":"F132+F107+F112+F117+F122+F127","v":54000},{"$f":"F131+F106+F111+F116+F121+F126","v":16200},{"$f":"F130+F105+F110+F115+F120+F125","v":0}]
[null,"YARLANILAN 32/A İNDİRİMİ TUTARI",{"$f":"K108+K113+K118+K123+K128+K133","v":0},{"$f":"K107+K112+K122+K127+K132","v":0},{"$f":"K106+K111+K116+K121+K126+K131","v":0},{"$f":"K105++K110+K115+K120+K125+K130","v":0}]
[]
[null,"32/A UYGULANABİLECEK MATRAH (1.TEŞVİK BELGESİ)",{"$f":"C84","v":0},"KV MATRAHI","1 - 5 PUAN İNDİRİM OLMASAYDI HESAPLANAN KV TUTARI","1 -5 Puan İndirim Tutarı","1 - 5 Puan İndirim Sonrasında Hesaplanan KV Tutarı","32/A İndirimi Olmasaydı Ödenecek KV Tutarı","1 -5 Puan İndirim ve 32/A VİO Uygulandıktan Sonra Tatbik Edilecek KV Oranı","1 -5 Puan İndirim ve 32/A İndirimi Uygulandıktan Sonra Ödenecek  KV Tutarı","Yararlanılan Yatırıma Katkı Tutarı\n(32/A İnd. KV Nedeniyle Vazgeçilen Vergi Tutarı)","Ödenecek KV Tutarı"]
[null,"GENEL ORANA TABİ KISIM (DİĞER FAALİYETLER)",{"$f":"F93","v":0},{"$f":"C104*C105","v":0},{"$f":"D105*$H$94","v":0},0,{"$f":"E105-F105","v":0},{"$f":"G105","v":0},{"$f":"($H$94)-(($H$94)*$C$82)","v":0.25},{"$f":"I105*D105","v":0},{"$f":"G105-J105","v":0},{"$f":"J108","v":0}]
[null,"1 PUAN İNDİRİMLİ ORANA TABİ KISIM  (İMALAT)",{"$f":"E93","v":0.6},{"$f":"C104*C106","v":0},{"$f":"D106*$H$94","v":0},{"$f":"D106/100","v":0},{"$f":"E106-F106","v":0},{"$f":"G106","v":0},{"$f":"($H$94-0.01)-(($H$94-0.01)*$C$82)","v":0.24},{"$f":"I106*D106","v":0},{"$f":"G106-J106","v":0}]
[null,"5 PUAN İNDİRİMLİ ORANA TABİ KISIM  ( İHRACAT)",{"$f":"D93","v":0.4},{"$f":"C104*C107","v":0},{"$f":"D107*$H$94","v":0},{"$f":"D107/20","v":0},{"$f":"E107-F107","v":0},0,{"$f":"($H$94-0.05)-(($H$94-0.05)*C82)","v":0.2},0,{"$f":"G107-J107","v":0}]
[null,"TOPLAM",{"$f":"SUM(C105:C107)","v":1},{"$f":"SUM(D105:D107)","v":0},0,{"$f":"SUM(F105:F107)","v":0},{"$f":"SUM(G105:G107)","v":0},{"$f":"SUM(H105:H107)","v":0},null,0,0]
[null,"32/A UYGULANABİLECEK MATRAH (2.TEŞVİK BELGESİ)",{"$f":"D84","v":0},"KV MATRAHI","1 - 5 PUAN İNDİRİM OLMASAYDI HESAPLANAN KV TUTARI","1 -5 Puan İndirim Tutarı","1 -5 Puan İndirim Sonrasında Hesaplanan KV Tutarı","32/A İndirimi Olmasaydı Ödenecek KV Tutarı","1 - 5 Puan İndirim ve 32/A VİO Uygulandıktan Sonra Tatbik Edilecek KV Oranı","1-5  Puan İndirim ve 32/A İndirimi Uygulandıktan Sonra Ödenecek  KV Tutarı","Yararlanılan Yatırıma Katkı Tutarı\n(32/A İnd. KV Nedeniyle Vazgeçilen Vergi Tutarı)","Ödenecek KV Tutarı"]
[null,"GENEL ORANA TABİ KISIM (DİĞER FAALİYETLER)",{"$f":"F93","v":0},{"$f":"C109*C110","v":0},{"$f":"D110*$H$94","v":0},0,{"$f":"E110-F110","v":0},{"$f":"G110","v":0},{"$f":"($H$94)-(($H$94)*D82)","v":0.25},{"$f":"I110*D110","v":0},{"$f":"G110-J110","v":0},{"$f":"J113","v":0}]
[null,"1 PUAN İNDİRİMLİ ORANA TABİ KISIM  (İMALAT)",{"$f":"E93","v":0.6},{"$f":"C109*C111","v":0},{"$f":"D111*$H$94","v":0},{"$f":"D111/100","v":0},{"$f":"E111-F111","v":0},{"$f":"G111","v":0},{"$f":"($H$94-0.01)-(($H$94-0.01)*D82)","v":0.24},{"$f":"I111*D111","v":0},{"$f":"G111-J111","v":0}]
[null,"5 PUAN İNDİRİMLİ ORANA TABİ KISIM  ( İHRACAT)",{"$f":"D93","v":0.4},{"$f":"C109*C112","v":0},{"$f":"D112*$H$94","v":0},{"$f":"D112/20","v":0},{"$f":"E112-F112","v":0},0,{"$f":"($H$94-0.05)-(($H$94-0.05)*D82)","v":0.2},0,{"$f":"G112-J112","v":0}]
[null,"TOPLAM",{"$f":"SUM(C110:C112)","v":1},0,0,{"$f":"SUM(F110:F112)","v":0},{"$f":"SUM(G110:G112)","v":0},{"$f":"SUM(H110:H112)","v":0},null,{"$f":"SUM(J110:J112)","v":0},0]
[null,"32/A UYGULANABİLECEK MATRAH (3.TEŞVİK BELGESİ)",{"$f":"E84","v":0},"KV MATRAHI","1 - 5 PUAN İNDİRİM OLMASAYDI HESAPLANAN KV TUTARI","1-5 Puan İndirim Tutarı","1 - 5 Puan İndirim Sonrasında Hesaplanan KV Tutarı","32/A İndirimi Olmasaydı Ödenecek KV Tutarı","1 - 5 Puan İndirim ve 32/A VİO Uygulandıktan Sonra Tatbik Edilecek KV Oranı","1 -5 Puan İndirim ve 32/A İndirimi Uygulandıktan Sonra Ödenecek  KV Tutarı","Yararlanılan Yatırıma Katkı Tutarı\n(32/A İnd. KV Nedeniyle Vazgeçilen Vergi Tutarı)","Ödenecek KV Tutarı"]
[null,"GENEL ORANA TABİ KISIM (DİĞER FAALİYETLER)",{"$f":"F93","v":0},{"$f":"C114*C115","v":0},{"$f":"D115*$H$94","v":0},0,{"$f":"E115-F115","v":0},{"$f":"G115","v":0},{"$f":"($H$94)-(($H$94)*E82)","v":0.25},{"$f":"I115*D115","v":0},{"$f":"G115-J115","v":0},{"$f":"J118","v":0}]
[null,"1 PUAN İNDİRİMLİ ORANA TABİ KISIM  (İMALAT)",{"$f":"E93","v":0.6},{"$f":"C114*C116","v":0},{"$f":"D116*$H$94","v":0},{"$f":"D116/100","v":0},{"$f":"E116-F116","v":0},{"$f":"G116","v":0},{"$f":"($H$94-0.01)-(($H$94-0.01)*E82)","v":0.24},{"$f":"I116*D116","v":0},{"$f":"G116-J116","v":0}]
[null,"5 PUAN İNDİRİMLİ ORANA TABİ KISIM  ( İHRACAT)",{"$f":"D93","v":0.4},{"$f":"C114*C117","v":0},{"$f":"D117*$H$94","v":0},{"$f":"D117/20","v":0},{"$f":"E117-F117","v":0},0,{"$f":"($H$94-0.05)-(($H$94-0.05)*E82)","v":0.2},0,{"$f":"G117-J117","v":0}]
[null,"TOPLAM",{"$f":"SUM(C115:C117)","v":1},0,0,{"$f":"SUM(F115:F117)","v":0},{"$f":"SUM(G115:G117)","v":0},{"$f":"SUM(H115:H117)","v":0},null,{"$f":"SUM(J115:J117)","v":0},0]
[null,"32/A UYGULANABİLECEK MATRAH (4. TEŞVİK BELGESİ)",{"$f":"F84","v":0},"KV MATRAHI","1 - 5 PUAN İNDİRİM OLMASAYDI HESAPLANAN KV TUTARI","1-5 Puan İndirim Tutarı","1 -5 Puan İndirim Sonrasında Hesaplanan KV Tutarı","32/A İndirimi Olmasaydı Ödenecek KV Tutarı","1- 5  Puan İndirim ve 32/A VİO Uygulandıktan Sonra Tatbik Edilecek KV Oranı","1-5 Puan İndirim ve 32/A İndirimi Uygulandıktan Sonra Ödenecek  KV Tutarı","Yararlanılan Yatırıma Katkı Tutarı\n(32/A İnd. KV Nedeniyle Vazgeçilen Vergi Tutarı)","Ödenecek KV Tutarı"]
[null,"GENEL ORANA TABİ KISIM (DİĞER FAALİYETLER)",{"$f":"F93","v":0},{"$f":"C119*C120","v":0},{"$f":"D120*$H$94","v":0},0,{"$f":"E120-F120","v":0},{"$f":"G120","v":0},{"$f":"($H$94)-(($H$94)*F82)","v":0.25},{"$f":"I120*D120","v":0},{"$f":"G120-J120","v":0},{"$f":"J123","v":0}]
[null,"1 PUAN İNDİRİMLİ ORANA TABİ KISIM  (İMALAT)",{"$f":"E93","v":0.6},{"$f":"C119*C121","v":0},{"$f":"D121*$H$94","v":0},{"$f":"D121/100","v":0},{"$f":"E121-F121","v":0},{"$f":"G121","v":0},{"$f":"($H$94-0.01)-(($H$94-0.01)*F82)","v":0.24},{"$f":"I121*D121","v":0},{"$f":"G121-J121","v":0}]
[null,"5 PUAN İNDİRİMLİ ORANA TABİ KISIM  ( İHRACAT)",{"$f":"D93","v":0.4},{"$f":"C119*C122","v":0},{"$f":"D122*$H$94","v":0},{"$f":"D122/20","v":0},{"$f":"E122-F122","v":0},0,{"$f":"($H$94-0.05)-(($H$94-0.05)*F82)","v":0.2},0,{"$f":"G122-J122","v":0}]
[null,"TOPLAM",{"$f":"SUM(C120:C122)","v":1},0,0,{"$f":"SUM(F120:F122)","v":0},{"$f":"SUM(G120:G122)","v":0},{"$f":"SUM(H120:H122)","v":0},null,{"$f":"SUM(J120:J122)","v":0},0]
[null,"32/A UYGULANABİLECEK MATRAH (5.TEŞVİK BELGESİ)",{"$f":"G84","v":0},"KV MATRAHI","1 - 5 PUAN İNDİRİM OLMASAYDI HESAPLANAN KV TUTARI","1-5 Puan İndirim Tutarı","1 - 5 Puan İndirim Sonrasında Hesaplanan KV Tutarı","32/A İndirimi Olmasaydı Ödenecek KV Tutarı","1 -5 Puan İndirim ve 32/A VİO Uygulandıktan Sonra Tatbik Edilecek KV Oranı","1 - 5 Puan İndirim ve 32/A İndirimi Uygulandıktan Sonra Ödenecek  KV Tutarı","Yararlanılan Yatırıma Katkı Tutarı\n(32/A İnd. KV Nedeniyle Vazgeçilen Vergi Tutarı)","Ödenecek KV Tutarı"]
[null,"GENEL ORANA TABİ KISIM (DİĞER FAALİYETLER)",{"$f":"F93","v":0},{"$f":"C124*C125","v":0},{"$f":"D125*$H$94","v":0},0,{"$f":"E125-F125","v":0},{"$f":"G125","v":0},{"$f":"($H$94)-(($H$94)*G82)","v":0.25},{"$f":"I125*D125","v":0},{"$f":"G125-J125","v":0},{"$f":"J128","v":0}]
[null,"1 PUAN İNDİRİMLİ ORANA TABİ KISIM  (İMALAT)",{"$f":"E93","v":0.6},{"$f":"C124*C126","v":0},{"$f":"D126*$H$94","v":0},{"$f":"D126/100","v":0},{"$f":"E126-F126","v":0},{"$f":"G126","v":0},{"$f":"($H$94-0.01)-(($H$94-0.01)*G82)","v":0.24},{"$f":"I126*D126","v":0},{"$f":"G126-J126","v":0}]
[null,"5 PUAN İNDİRİMLİ ORANA TABİ KISIM  ( İHRACAT)",{"$f":"D93","v":0.4},{"$f":"C124*C127","v":0},{"$f":"D127*$H$94","v":0},{"$f":"D127/20","v":0},{"$f":"E127-F127","v":0},0,{"$f":"($H$94-0.05)-(($H$94-0.05)*G82)","v":0.2},0,{"$f":"G127-J127","v":0}]
[null,"TOPLAM",{"$f":"SUM(C125:C127)","v":1},0,0,{"$f":"SUM(F125:F127)","v":0},{"$f":"SUM(G125:G127)","v":0},{"$f":"SUM(H125:H127)","v":0},null,{"$f":"SUM(J125:J127)","v":0},0]
[null,"32/A UYGULANAMAYACAK MATRAH",{"$f":"IF(C85<=0,0,C85)","v":2700000},"KV MATRAHI","1-5 PUAN İNDİRİM OLMASAYDI HESAPLANAN KV TUTARI","1-5 Puan İndirim Tutarı","1 -5 Puan İndirim Sonrasında Hesaplanan KV Tutarı","32/A İNDİRİMİ UYGULANMAZ",null,"1 Puan İndirim ve 32/A İndirimi Uygulandıktan Sonra Ödenecek  KV Tutarı","Yararlanılan Yatırıma Katkı Tutarı\n(32/A İnd. KV Nedeniyle Vazgeçilen Vergi Tutarı)","Ödenecek KV Tutarı"]
[null,"GENEL ORANA TABİ KISIM (DİĞER FAALİYETLER)",{"$f":"F93","v":0},{"$f":"C129*C130","v":0},{"$f":"D130*$H$94","v":0},0,{"$f":"E130-F130","v":0},null,null,{"$f":"G130","v":0},{"$f":"G130-J130","v":0},{"$f":"J133","v":604800}]
[null,"1 PUAN İNDİRİMLİ ORANA TABİ KISIM  (İMALAT)",{"$f":"E93","v":0.6},{"$f":"C131*C129","v":1620000},{"$f":"D131*$H$94","v":405000},{"$f":"D131/100","v":16200},{"$f":"E131-F131","v":388800},null,null,{"$f":"G131","v":388800},{"$f":"G131-J131","v":0}]
[null,"5 PUAN İNDİRİMLİ ORANA TABİ KISIM  ( İHRACAT)",{"$f":"D93","v":0.4},{"$f":"C132*C129","v":1080000},{"$f":"D132*$H$94","v":270000},{"$f":"D132/20","v":54000},{"$f":"E132-F132","v":216000},null,null,216000,0]
[null,"TOPLAM",{"$f":"SUM(C130:C132)","v":1},{"$f":"SUM(D130:D132)","v":2700000},675000,{"$f":"SUM(F130:F132)","v":70200},{"$f":"SUM(G130:G132)","v":604800},null,null,604800,0]
[null,"TOPLAM KV MATRAHI VE ÖDENMESİ GEREKEN KV ",{"$f":"C104+C129+C109+C114+C119+C124","v":2700000},{"$f":"D108+D133+D113+D118+D123+D128","v":2700000},{"$f":"E108+E133+E113+E118+E123+E128","v":675000},{"$f":"F108+F133+F113+F118+F123+F128","v":70200},{"$f":"G108+G133+G113+G118+G123+G128","v":604800},null,null,{"$f":"J108+J133+J113+J118+J123+J128","v":604800},{"$f":"K133+K108+K113+K118+K123+K128","v":0},{"$f":"L105+L130+L110+L115+L120+L125","v":604800}]
[]
[null,"GEÇİCİ VERGİ BEYANNMESİNDE MATRAH BİLDİRİMİ BÖLÜMÜNDE DOLDURULACAK KISIMLAR VE TUTARLARI"]
[null,"32 A Madde Kapsamında İndirimli Kurumlar Vergisine (Geçici Vergiye) Tabi Matrah",{"$f":"C104+C109+C114+C119+C124","v":0},{"$f":"E108+E113+E118+E123+E128","v":0},"1-5 Puan Olmasaydı Hesaplan KV Tutarı"]
[null,null,null,{"$f":"G108+G113+G118+G123++G128","v":0},"1 -5 Puan İndirim Sonrasında Ödenecek KV Tutarı\n (32 A olmasaydı hesaplanacak Vergi)"]
[null,null,null,{"$f":"K108+K113+K118+K123+K128","v":0},"32/A İndirimi ile Vazgeçilen Vergi"]
[null,"32 A Madde Kapsamında İndirimli Kurumlar Vergisi(Geçici Vergi) Oranı",{"$f":"IFERROR(D140/C137,0)","v":0},{"$f":"L105+L110+L115+L120+L125","v":0},"32/A ya Tabi Matrah Üzerinden Ödenecek KV"]
[null,"32/7 Madde Kapsamında İndirimli Kurumlar Vergisine (Geçici Vergiye) Tabi Matrah  (İhracat)",{"$f":"D132","v":1080000},{"$f":"E132","v":270000},"5 Puan Olmasaydı Hesaplan KV Tutarı"]
[null,null,null,{"$f":"F132","v":54000},"5 Puan İndirimin Vergi Etkisi "]
[null,"32/7 Madde Kapsamında İndirimli Kurumlar Vergisi (Geçici Vergi) Oranı",{"$f":"IFERROR(D143/C141,0)","v":0.2},{"$f":"G132","v":216000},"5 Puan İndirim Sonrasında Ödenecek KV Tutarı (İhracat)\n"]
[null,"32/8 Madde Kapsamında İndirimli Kurumlar Vergisine (Geçici Vergiye) Tabi Matrah  (Üretim)",{"$f":"D131","v":1620000},{"$f":"E131","v":405000},"1 Puan Olmasaydı Hesaplan KV Tutarı"]
[null,null,null,{"$f":"F131","v":16200},"1 Puan İndirimin Vergi Etkisi "]
[null,"32/8 Madde Kapsamında İndirimli Kurumlar Vergisi (Geçici Vergi) Oranı",{"$f":"IFERROR(D146/C144,0)","v":0.24},{"$f":"G131","v":388800},"1 Puan İndirim Sonrasında Ödenecek KV Tutarı (Üretim)\n"]
[null,"Genel Orana Tabi Matrah (Diğer)",{"$f":"D130","v":0},{"$f":"J130","v":0},"Diğer Faalilyetlerden Elde Edilen Kazanç"]
[null,null,{"$f":"IFERROR(D147/C147,0)","v":0}]
[null,"MATRAHLAR TOPLAMI",{"$f":"C137+C144+C141+C147","v":2700000},{"$f":"D140+D146+D143+D147","v":604800}]

{"sheet":"32-1-2-9-1 Ö","index":14,"n_rows":149,"n_cols":12,"rows_kept":149,"cut":false,"hidden":true,"merged":[[84,2,84,6],[1,1,2,1],[59,1,59,2],[60,1,60,2],[71,1,72,1],[73,1,73,2],[74,1,74,2],[74,3,74,4],[75,1,75,2],[75,3,75,4],[79,1,79,3],[82,2,82,6],[85,2,85,6],[87,1,89,1],[87,2,88,2],[87,3,88,3],[87,4,88,4],[87,5,88,5],[135,1,135,4],[137,1,138,2],[104,11,107,11],[109,11,112,11],[114,11,117,11],[119,11,122,11],[124,11,127,11],[128,7,133,8],[129,11,132,11]]}
[]
[null,"FAALİYET TÜRLERİ İTİBARİYLE HASILATLAR VE TOPLAM İÇİNDEKİ ORANLARI",{"$f":"IFERROR(C4/C4,0)","v":1},{"$f":"IFERROR(D4/C4,0)","v":0.4},{"$f":"IFERROR(E4/C4,0)","v":0},{"$f":"IFERROR(F4/C4,0)","v":0.6}]
[null,null,"Toplam Hasılat","İhracat faaliyeti","İmalat faaliyeti","Diğer faaliyetler"]
[null,"A-BRÜT SATIŞLAR (60)",{"$f":"D4+E4+F4","v":2000000},{"$f":"SUM(D5:D7)","v":800000},{"$f":"SUM(E5:E7)","v":0},1200000]
[null,"1-Yurtiçi Satışlar (600)",{"$f":"D5+E5+F5","v":1200000},null,null,1200000]
[null,"2-Yurtdışı Satışlar (601)",{"$f":"D6+E6+F6","v":800000},800000]
[null,"3-Diğer Gelirler (602)",{"$f":"D7+E7+F7","v":0}]
[null,"B-SATIŞ İNDİRİMLERİ(-) (61)",{"$f":"SUM(C9:C11)","v":0},{"$f":"SUM(D9:D11)","v":0},{"$f":"SUM(E9:E11)","v":0},0]
[null,"1-Satıştan İadeler (-) (610)",{"$f":"SUM(D9:F9)","v":0}]
[null,"2- Satış İskontoları (-) (611)",{"$f":"SUM(D10:F10)","v":0}]
[null,"3-Diğer İndirimler (-) (612)",0]
[null,"C-NET SATIŞLAR",{"$f":"C4-C8","v":2000000},{"$f":"D4-D8","v":800000},{"$f":"E4-E8","v":0},1200000]
[null,"D-SATIŞLARIN MALİYETİ (-) (62)",{"$f":"SUM(C14:C17)","v":0},{"$f":"SUM(D14:D17)","v":0},{"$f":"SUM(E14:E17)","v":0},{"$f":"SUM(F14:F17)","v":0}]
[null,"1-Satılan Mamuller Maliyeti ( 620)",{"$f":"SUM(D14:F14)","v":0}]
[null,"2-Satılan Ticari Mal Maliyeti (621)",{"$f":"SUM(D15:F15)","v":0}]
[null,"3-Satılan Hizmet Maliyeti (622)",0]
[null,"4-Diğer Satışların Maliyeti (623)",0]
[null,"BRÜT SATIŞ KARI / ZARARI",{"$f":"C12-C13","v":2000000},{"$f":"D12-D13","v":800000},{"$f":"E12-E13","v":0},1200000]
[null,"E-FAALİYET GİDERLERİ (-) (63)",{"$f":"SUM(C20:C24)","v":0},{"$f":"SUM(D20:D24)","v":0},{"$f":"SUM(E20:E24)","v":0},0]
[null,"1-Araştırma ve Geliştirme Giderleri(-) (630)",{"$f":"SUM(D20:F20)","v":0}]
[null,"2-Pazarlama, Satış ve Dağıtım Giderleri(-) (631)",{"$f":"SUM(D21:F21)","v":0}]
[null,"3-Genel Yönetim Giderleri(-) (632)",{"$f":"SUM(D22:F22)","v":0}]
[null,"MÜŞTEREK GENEL GİDERLER (DAĞITIM-HASILAT PAYINA GÖRE)",null,{"$f":"C23*D2","v":0},{"$f":"C23*E2","v":0},{"$f":"C23*F2","v":0}]
[null,"MÜŞTEREK GENEL GİDER GİBİ DAĞITIMA TABİ TUTULACAK AMORTİSMAN GİDERLERİ  (DAĞITIM-HASILAT PAYINA GÖRE)",null,{"$f":"C24*D2","v":0},{"$f":"C24*E2","v":0},{"$f":"C24*F2","v":0}]
[null,"FAALİYET KARI / ZARARI ",{"$f":"C18-C19","v":2000000},{"$f":"D18-D19","v":800000},{"$f":"E18-E19","v":0},1200000]
[null,"F-DİĞER FAALİYETLERDEN OLAĞAN GELİR VE KARLAR (64)",{"$f":"SUM(C27:C35)","v":0},{"$f":"SUM(D27:D35)","v":0},{"$f":"SUM(E27:E35)","v":0},{"$f":"SUM(F27:F35)","v":0}]
[null,"         1- İŞTİRAKLERDEN TEMETTÜ GELİRLERİ (640)",{"$f":"SUM(D27:F27)","v":0}]
[null,"         2- BAĞLI ORTAKLIKLARDAN TEMETTÜ GELİRLERİ (641)",{"$f":"SUM(D28:F28)","v":0}]
[null,"         3- FAİZ GELİRLERİ (642) (ihracat ve imalat kaynaklı alacağın tahsiline kadar olan süreçte oluşan)",0]
[null,"         4- KOMİSYON GELİRLERİ (643)",0]
[null,"         5- KONUSU OLMAYAN KARŞILIKLAR (644)",0]
[null,"         6- MENKUL KIYMET SATIŞ KARLARI (645)",0]
[null,"         7- KAMBİYO KARLARI (646) (ihracat ve imalat kaynaklı alacağın tahsiline kadar olan süreçte oluşan)",0]
[null,"         8- REESKONT FAİZ GELİRLERİ (647)",0]
[null,"         9- FAALİYETLE İLGİLİ DİĞER GELİR VE KARLAR (649)",0]
[null,"ARA TOPLAM",{"$f":"C25+C26","v":2000000},{"$f":"D25+D26","v":800000},{"$f":"E25+E26","v":0},{"$f":"F25+F26","v":1200000}]
[null,"G-DİĞER FAALİYETLERDEN OLAĞAN GİDER VE ZARARLAR(-) (65)",{"$f":"SUM(C38:C43)","v":0},{"$f":"SUM(D38:D43)","v":0},{"$f":"SUM(E38:E43)","v":0},0]
[null,"         1- KOMİSYON GİDERLERİ (653)",{"$f":"SUM(D38:F38)","v":0}]
[null,"         2- KARŞILIK GİDERLERİ (654)",{"$f":"SUM(D39:F39)","v":0}]
[null,"         3- MENKUL KIYMET SATIŞ ZARARLARI (655)",0]
[null,"         4- KAMBİYO ZARARLARI (656) (ihracat ve imalat kaynaklı alacağın tahsiline kadar olan süreçte oluşan)",0]
[null,"         5- REESKONT FAİZ GİDERLERİ (657)",0]
[null,"         6- DİĞER OLAĞAN GİDER VE ZARARLAR (659)",{"$f":"SUM(D43:F43)","v":0}]
[null,"ARA TOPLAM",{"$f":"C36-C37","v":2000000},{"$f":"D36-D37","v":800000},{"$f":"E36-E37","v":0},1200000]
[null,"H-FİNANSMAN GİDERLERİ(-) (66)",{"$f":"SUM(C46:C49)","v":0},{"$f":"SUM(D46:D49)","v":0},{"$f":"SUM(E46:E49)","v":0},{"$f":"SUM(F46:F49)","v":0}]
[null,"         1- KISA VADELİ BORÇLANMA GİDERLERİ (-)",{"$f":"SUM(D46:F46)","v":0}]
[null,"         2- UZUN VADELİ BORÇLANMA GİDERLERİ (-)",{"$f":"SUM(D47:F47)","v":0}]
[null,"         1- KISA VADELİ BORÇLANMA GİDERLERİ (-) (DAĞITIM)",null,{"$f":"C48*D2","v":0},{"$f":"C48*E2","v":0},{"$f":"C48*F2","v":0}]
[null,"         2- UZUN VADELİ BORÇLANMA GİDERLERİ (-) (DAĞITIM)",null,{"$f":"C49*D2","v":0},{"$f":"C49*E2","v":0},{"$f":"C49*F2","v":0}]
[null,"ARA TOPLAM",{"$f":"C44-C45","v":2000000},{"$f":"D44-D45","v":800000},{"$f":"E44-E45","v":0},{"$f":"F44-F45","v":1200000}]
[null,"I-OLAĞANDIŞI GELİR VE KÂRLAR (67)",{"$f":"SUM(D51:F51)","v":0},{"$f":"SUM(D52:D53)","v":0},{"$f":"SUM(E52:E53)","v":0},{"$f":"SUM(F52:F53)","v":0}]
[null,"1- ÖNCEKİ DÖNEM GELİR VE KARLARI (671)",{"$f":"SUM(D52:F52)","v":0}]
[null,"2-DİĞER OLAĞAN DIŞI GELİR VE KARLAR (679)",{"$f":"SUM(D53:F53)","v":0}]
[null,"ARA TOPLAM",{"$f":"SUM(D54:F54)","v":2000000},{"$f":"D50+D51","v":800000},{"$f":"E50+E51","v":0},1200000]
[null,"J-OLAĞANDIŞI GİDER VE ZARARLAR(-) (68)",{"$f":"SUM(C56:C58)","v":0},{"$f":"SUM(D56:D58)","v":0},{"$f":"SUM(E56:E58)","v":0},0]
[null,"1-Çalışmayan Kısım Gider ve Zararları(-) (680)",{"$f":"SUM(D56:F56)","v":0}]
[null,"2-Önceki Dönem Gider ve Zararları(-) (681)",{"$f":"SUM(D57:F57)","v":0}]
[null,"3-Diğer Olağan Dışı Gider ve Zararlar(-) (689)",0]
[null,"DÖNEM KÂRI VEYA ZARARI \n(TİCARİ BİLANÇO KARI ZARARI )",{"$f":"C54-C55","v":2000000},{"$f":"D54-D55","v":800000},{"$f":"E54-E55","v":0},1200000]
[null,"İHRACAT, İMALAT VE DİĞER FAALİYETLERDEN ELDE EDİLEN KAZANCIN TOPLAM TİCARİ KAZANÇ İÇİNDEKİ PAYLARI  \n\n(Kazançlar arasında Öncelik İhracat Kazancına Verilmiştir. İhrcat Kazancından arta kalan Ticari Kazanç İmalat ve Diğer Faaliyetlere Sayılmıştır.)\n\n",null,{"$f":"IF(D59>=$C$59,1,\n    IF(D59<=0,0,\n    IF(AND(D59>0,D59<$C$59),D59/$C$59)))","v":0.4},{"$f":"IF(E59>=$C$59,1,\n    IF(E59<=0,0,\n    IF(AND(E59>0,E59<$C$59),E59/$C$59)))","v":0},{"$f":"IF(F59>=$C$59,1,\n    IF(F59<=0,0,\n    IF(AND(F59>0,F59<$C$59),F59/$C$59)))","v":0.6}]
[null,null,null,{"$f":"D60/(D60+E60+F60)","v":0.4},{"$f":"E60/(D60+E60+F60)","v":0},{"$f":"F60/(D60+E60+F60)","v":0.6}]
[]
[null,"KKEG +",200000]
[null," KABUL EDİLMEYEN GELİRLER -"]
[null,"ZARAR OLSA DAHİ İNDİRİLECEK İSTİSNALAR -",{"$f":"C66+C67+C68","v":1000000}]
[null,"Hizmet İhracatı Faaliyetinden (KVK 10-1/ğ) Elde Edilen Kazançlardan İstisna Edilenlerin Toplamı",400000]
[null,"İmalat Faaliyetinden Elde Edilen Kazançlardan İstisna Edilenlerin Toplamı"]
[null,"Diğer Faaliyetlerden Elde Edilen Kazançlardan İstisna Edilenlerin Toplamı",600000]
[null,"GEÇMİŞ YIL ZARARLARI -"]
[null,"İNDİRİMLER -",null,"AZAMİ YAZILABİLECEK İNDİRİMLER TUTARI",{"$f":"C59+C63-C64-C65-C69","v":1200000}]
[]
[null,"1 PUAN İNDİRİM UYGULANACAK TUTARIN HESABINDA İSTİSNA KAZANÇLAR DÜŞÜLDÜKTEN SONRA BULUNAN TİCARİ KAZANÇ TUTARI İLE  İHRACAT,İMALAT VE DİĞER KAZANÇLARIN TUTARI","TİCARİ KAZANÇ TAN İhracat ve İmalat Kazancından İstisna Olan Tutarlar Düşüldükten Sonra Kalan Tutarı","İhracat Faaliyetinden Elde Edilen  Kazançtan İstisna Olan Kısım Düşüldükten Sonra Bulunan Tutarı","Üretim  Faaliyetinden Elde Edilen  Kazançtan İstisna Olan Kısım Düşüldükten Sonra Bulunan Tutarı","Diğer Faaliyetinden Elde Edilen  Kazanç"]
[null,null,{"$f":"IF(C59-C66-C67<=0,0,C59-C66-C67)","v":1600000},{"$f":"IF($D$59-C66<=0,0,MIN($D$59-C66,$C$73*D61))","v":400000},{"$f":"IF($E$59-C67<=0,0,MIN($E$59-C67,$C$73*E61))","v":0},{"$f":"IF(C73-D73-E73<=0,0,C73-D73-E73)","v":1200000}]
[null,"MATRAH DAĞITIM PAYLARI",null,{"$f":"IFERROR(IF(D73/C73<=0,0,D73/C73),0)","v":0.25},{"$f":"IFERROR(IF(E73/C73<=0,0,E73/C73),0)","v":0},{"$f":"IFERROR(F73/C73,0)","v":0.75}]
[null,"İHRACAT, İMALAT VE DİĞER FAALİYETLERDEN ELDE EDİLEN KAZANCIN TOPLAM TİCARİ KAZANÇ İÇİNDEKİ PAYLARI ",null,{"$f":"IFERROR(IF(AND(D73+E73>C73, F73<=0),1,(D73+E73)/C73),0)","v":0.25},null,{"$f":"IFERROR(IF(F73<=0,0,F73/C73),0)","v":0.75}]
[null,"NEGATİF VE % 100 DEN BÜYÜKLÜK KONTROLÜ SONRASINDAKİ PAYLARI",null,{"$f":"IFERROR(IF(D75<=0,0,IF(D75>1,1,D75)),0)","v":0.25},null,{"$f":"IFERROR(IF(F75<=0,0,IF(F75>1,1,F75)),0)","v":0.75}]
[]
[null,"SAFİ KURUM KAZANCI \n(KURUMLAR VERGİSİ MATRAHI)",{"$f":"C59+C63-C64-C65-C69-C70","v":1200000},{"$f":"IF(C78<0, \"ZARAR\",\"KAR\")","v":"KAR"}]
[]
[null,"2022 YILI 3. DÖNEM İNDİRİMLİ KURUMLAR VERGİSİ HESAPLAMA TABLOSU"]
[null,null,"1. TEŞVİK BELGESİ","2. TEŞVİK BELGESİ","3. TEŞVİK BELGESİ","4. TEŞVİK BELGESİ","5. TEŞVİK BELGESİ"]
[null,"Vergi İndirim Oranı (VİO)"]
[null,"KV MATRAHI (Safi Kurum Kazancı)",{"$f":"C78","v":1200000}]
[null,"32/A  Uygulanacak K.V. Matrahı (HER BİR TEŞVİK BELGESİ KAPSAMINDA YARARLANILABİLECEK YATIRIMA KATKI TUTARININ MATRAHI BU HÜCRELERE YAZILMALIDIR)",null,null,null,null,null,{"$f":"IF(SUM(C84:G84)>C78,\"32/A İNDİRİMİ UYGULANACAK KAZANÇ, SAFİ KURUM KAZANCINDAN FAZLADIR\",SUM(C84:G84))","v":0}]
[null,"32/A UYGULANMAYACAK K.V.  Matrahı",{"$f":"IF(C83-(C84+D84+E84+F84+G84)<0,0,C83-(C84+D84+E84+F84+G84))","v":1200000}]
[null,"MATRAH TOPLAMI",{"$f":"IF((C84+D84+E84+F84+G84+C85)>C78,C78,(C84+D84+E84+F84+G84+C85))","v":1200000}]
[]
[null,"SAFİ KURUM KAZANCININ  KV VERGİ ORANLARI İTİBARİYLE DAĞILIMI ","TOPLAM SAFİ KAZANÇ","İhracat Kazancı Payı","Üretim Kazancı Payı","Diğer Faaliyet Kazancı Payı"]
[]
[null,null,{"$f":"C78","v":1200000},{"$f":"IF(AND(AND($D$59>0,($D$59+$E$59)>=$C$59,D59>=C66),$C$90>=MAX(D59,D73)),\n\nMIN(MAX(IF(D59<=C90,D59,IF(D73<=C90,D73)),$C$90*D74)),\n\nIF(OR(D59<=0,D73<=0),0,\n\nMIN( MAX(   MAX(   IF(D59<=C90,D59),  IF(D73<=C90,D73) ),    MIN($C$90*D74,D59,D73)),$C$90)))","v":800000},{"$f":"MIN( IF(AND(AND($E$59>0,($D$59+$E$59)>=$C$59,E59>=C67),$C$90>=MAX(E59,E73)),\n\nMIN(MAX(IF(E59<=C90,E59,IF(E73<=C90,E73)),$C$90*E74)),\n\nIF(OR(E59<=0,E73<=0),0,\n\nMIN( MAX(   MAX(   IF(E59<=C90,E59),  IF(E73<=C90,E73) ),    MIN($C$90*E74,E59,E73)),$C$90))),C90-D90)","v":0},{"$f":"C90-D90-E90","v":400000}]
[null,"SAFİ KURUM KAZANCININ DAĞILIMI ORANSAL DAĞILIMI",{"$f":"C90","v":1200000},{"$f":"D90/C90","v":0.66666666666666663},{"$f":"E90/C90","v":0},{"$f":"F90/C90","v":0.33333333333333331}]
[null,"SAFİ KURUM KAZANCININ DAĞILIMI TUTARSAL",{"$f":"C91","v":1200000},{"$f":"D90","v":800000},{"$f":"E90","v":0},{"$f":"F90","v":400000}]
[null,"SAFİ KURUM KAZANCI DAĞILIMI",{"$f":"C92","v":1200000},{"$f":"IFERROR(IF(D92/C92>=1,1,D92/C92),0)","v":0.66666666666666663},{"$f":"IFERROR(IF(E92/C92>=1,1,E92/C92),0)","v":0},{"$f":"IFERROR(IF(F92/C92>=1,1,F92/C92),0)","v":0.33333333333333331},null,"KV ORANI"]
[null,"1 PUAN VE 32/A İNDİRİMİ OLMASAYDI HESAPLANAN KV TUTARI",{"$f":"C93*$H$94","v":300000},{"$f":"D92*$H$94","v":200000},{"$f":"E92*$H$94","v":0},{"$f":"F92*$H$94","v":100000},null,0.25]
[null,"32/ A UYGULANAN MATRAH",{"$f":"C84+D84+E84+F84+G84","v":0},{"$f":"D107+D112+D117+D122+D127","v":0},{"$f":"D106+D111+D116+D121+D126","v":0},{"$f":"D105+D110+D115+D120+D125","v":0}]
[null,"32/A UYGULANACAK MATRAH ÜZERİNDEN ÖDENECEK KV TUTARI",{"$f":"J108+J113+J118+J123+J128","v":0},{"$f":"J107+J112+J117+J122+J127","v":0},{"$f":"J106+J111+J116+J121+J126","v":0},{"$f":"J105+J110+J115+J120+J125","v":0}]
[null,"32/A UYGULANMAYAN MATRAH",{"$f":"IF(C85<=0,0,C85)","v":1200000},{"$f":"D132","v":800000},{"$f":"D131","v":0},{"$f":"D130","v":400000}]
[null,"32/A UYGULANMAYAN MATRAH ÜZERİNDEN ÖDENECEK KV TUTARI",{"$f":"L130","v":260000},{"$f":"J132","v":160000},{"$f":"J131","v":0},{"$f":"J130","v":100000}]
[null,"TOPLAM ÖDENECEK KV",{"$f":"C96+C98","v":260000},{"$f":"J132+J107","v":160000},{"$f":"J131+J106","v":0},{"$f":"J130+J105","v":100000}]
[null,"TOPLAM AVANTAJ  (YARARLANILAN 1 PUAN İNDİRİMİ + 32/A İNDİRİMİ TUTARI )",{"$f":"C94-C99","v":40000},{"$f":"D101+D102","v":40000},{"$f":"E101+E102","v":0},{"$f":"F101+F102","v":0}]
[null,"YARARLANILAN 1 - 5 PUAN İNDİRİMİ TUTARI",{"$f":"F133+F128+F123+F118+F113+F108","v":40000},{"$f":"F132+F107+F112+F117+F122+F127","v":40000},{"$f":"F131+F106+F111+F116+F121+F126","v":0},{"$f":"F130+F105+F110+F115+F120+F125","v":0}]
[null,"YARLANILAN 32/A İNDİRİMİ TUTARI",{"$f":"K108+K113+K118+K123+K128+K133","v":0},{"$f":"K107+K112+K122+K127+K132","v":0},{"$f":"K106+K111+K116+K121+K126+K131","v":0},{"$f":"K105++K110+K115+K120+K125+K130","v":0}]
[]
[null,"32/A UYGULANABİLECEK MATRAH (1.TEŞVİK BELGESİ)",{"$f":"C84","v":0},"KV MATRAHI","1 - 5 PUAN İNDİRİM OLMASAYDI HESAPLANAN KV TUTARI","1 -5 Puan İndirim Tutarı","1 - 5 Puan İndirim Sonrasında Hesaplanan KV Tutarı","32/A İndirimi Olmasaydı Ödenecek KV Tutarı","1 -5 Puan İndirim ve 32/A VİO Uygulandıktan Sonra Tatbik Edilecek KV Oranı","1 -5 Puan İndirim ve 32/A İndirimi Uygulandıktan Sonra Ödenecek  KV Tutarı","Yararlanılan Yatırıma Katkı Tutarı\n(32/A İnd. KV Nedeniyle Vazgeçilen Vergi Tutarı)","Ödenecek KV Tutarı"]
[null,"GENEL ORANA TABİ KISIM (DİĞER FAALİYETLER)",{"$f":"F93","v":0.33333333333333331},{"$f":"C104*C105","v":0},{"$f":"D105*$H$94","v":0},0,{"$f":"E105-F105","v":0},{"$f":"G105","v":0},{"$f":"($H$94)-(($H$94)*$C$82)","v":0.25},{"$f":"I105*D105","v":0},{"$f":"G105-J105","v":0},{"$f":"J108","v":0}]
[null,"1 PUAN İNDİRİMLİ ORANA TABİ KISIM  (İMALAT)",{"$f":"E93","v":0},{"$f":"C104*C106","v":0},{"$f":"D106*$H$94","v":0},{"$f":"D106/100","v":0},{"$f":"E106-F106","v":0},{"$f":"G106","v":0},{"$f":"($H$94-0.01)-(($H$94-0.01)*$C$82)","v":0.24},{"$f":"I106*D106","v":0},{"$f":"G106-J106","v":0}]
[null,"5 PUAN İNDİRİMLİ ORANA TABİ KISIM  ( İHRACAT)",{"$f":"D93","v":0.66666666666666663},{"$f":"C104*C107","v":0},{"$f":"D107*$H$94","v":0},{"$f":"D107/20","v":0},{"$f":"E107-F107","v":0},0,{"$f":"($H$94-0.05)-(($H$94-0.05)*C82)","v":0.2},0,{"$f":"G107-J107","v":0}]
[null,"TOPLAM",{"$f":"SUM(C105:C107)","v":1},{"$f":"SUM(D105:D107)","v":0},0,{"$f":"SUM(F105:F107)","v":0},{"$f":"SUM(G105:G107)","v":0},{"$f":"SUM(H105:H107)","v":0},null,0,0]
[null,"32/A UYGULANABİLECEK MATRAH (2.TEŞVİK BELGESİ)",{"$f":"D84","v":0},"KV MATRAHI","1 - 5 PUAN İNDİRİM OLMASAYDI HESAPLANAN KV TUTARI","1 -5 Puan İndirim Tutarı","1 -5 Puan İndirim Sonrasında Hesaplanan KV Tutarı","32/A İndirimi Olmasaydı Ödenecek KV Tutarı","1 - 5 Puan İndirim ve 32/A VİO Uygulandıktan Sonra Tatbik Edilecek KV Oranı","1-5  Puan İndirim ve 32/A İndirimi Uygulandıktan Sonra Ödenecek  KV Tutarı","Yararlanılan Yatırıma Katkı Tutarı\n(32/A İnd. KV Nedeniyle Vazgeçilen Vergi Tutarı)","Ödenecek KV Tutarı"]
[null,"GENEL ORANA TABİ KISIM (DİĞER FAALİYETLER)",{"$f":"F93","v":0.33333333333333331},{"$f":"C109*C110","v":0},{"$f":"D110*$H$94","v":0},0,{"$f":"E110-F110","v":0},{"$f":"G110","v":0},{"$f":"($H$94)-(($H$94)*D82)","v":0.25},{"$f":"I110*D110","v":0},{"$f":"G110-J110","v":0},{"$f":"J113","v":0}]
[null,"1 PUAN İNDİRİMLİ ORANA TABİ KISIM  (İMALAT)",{"$f":"E93","v":0},{"$f":"C109*C111","v":0},{"$f":"D111*$H$94","v":0},{"$f":"D111/100","v":0},{"$f":"E111-F111","v":0},{"$f":"G111","v":0},{"$f":"($H$94-0.01)-(($H$94-0.01)*D82)","v":0.24},{"$f":"I111*D111","v":0},{"$f":"G111-J111","v":0}]
[null,"5 PUAN İNDİRİMLİ ORANA TABİ KISIM  ( İHRACAT)",{"$f":"D93","v":0.66666666666666663},{"$f":"C109*C112","v":0},{"$f":"D112*$H$94","v":0},{"$f":"D112/20","v":0},{"$f":"E112-F112","v":0},0,{"$f":"($H$94-0.05)-(($H$94-0.05)*D82)","v":0.2},0,{"$f":"G112-J112","v":0}]
[null,"TOPLAM",{"$f":"SUM(C110:C112)","v":1},0,0,{"$f":"SUM(F110:F112)","v":0},{"$f":"SUM(G110:G112)","v":0},{"$f":"SUM(H110:H112)","v":0},null,{"$f":"SUM(J110:J112)","v":0},0]
[null,"32/A UYGULANABİLECEK MATRAH (3.TEŞVİK BELGESİ)",{"$f":"E84","v":0},"KV MATRAHI","1 - 5 PUAN İNDİRİM OLMASAYDI HESAPLANAN KV TUTARI","1-5 Puan İndirim Tutarı","1 - 5 Puan İndirim Sonrasında Hesaplanan KV Tutarı","32/A İndirimi Olmasaydı Ödenecek KV Tutarı","1 - 5 Puan İndirim ve 32/A VİO Uygulandıktan Sonra Tatbik Edilecek KV Oranı","1 -5 Puan İndirim ve 32/A İndirimi Uygulandıktan Sonra Ödenecek  KV Tutarı","Yararlanılan Yatırıma Katkı Tutarı\n(32/A İnd. KV Nedeniyle Vazgeçilen Vergi Tutarı)","Ödenecek KV Tutarı"]
[null,"GENEL ORANA TABİ KISIM (DİĞER FAALİYETLER)",{"$f":"F93","v":0.33333333333333331},{"$f":"C114*C115","v":0},{"$f":"D115*$H$94","v":0},0,{"$f":"E115-F115","v":0},{"$f":"G115","v":0},{"$f":"($H$94)-(($H$94)*E82)","v":0.25},{"$f":"I115*D115","v":0},{"$f":"G115-J115","v":0},{"$f":"J118","v":0}]
[null,"1 PUAN İNDİRİMLİ ORANA TABİ KISIM  (İMALAT)",{"$f":"E93","v":0},{"$f":"C114*C116","v":0},{"$f":"D116*$H$94","v":0},{"$f":"D116/100","v":0},{"$f":"E116-F116","v":0},{"$f":"G116","v":0},{"$f":"($H$94-0.01)-(($H$94-0.01)*E82)","v":0.24},{"$f":"I116*D116","v":0},{"$f":"G116-J116","v":0}]
[null,"5 PUAN İNDİRİMLİ ORANA TABİ KISIM  ( İHRACAT)",{"$f":"D93","v":0.66666666666666663},{"$f":"C114*C117","v":0},{"$f":"D117*$H$94","v":0},{"$f":"D117/20","v":0},{"$f":"E117-F117","v":0},0,{"$f":"($H$94-0.05)-(($H$94-0.05)*E82)","v":0.2},0,{"$f":"G117-J117","v":0}]
[null,"TOPLAM",{"$f":"SUM(C115:C117)","v":1},0,0,{"$f":"SUM(F115:F117)","v":0},{"$f":"SUM(G115:G117)","v":0},{"$f":"SUM(H115:H117)","v":0},null,{"$f":"SUM(J115:J117)","v":0},0]
[null,"32/A UYGULANABİLECEK MATRAH (4. TEŞVİK BELGESİ)",{"$f":"F84","v":0},"KV MATRAHI","1 - 5 PUAN İNDİRİM OLMASAYDI HESAPLANAN KV TUTARI","1-5 Puan İndirim Tutarı","1 -5 Puan İndirim Sonrasında Hesaplanan KV Tutarı","32/A İndirimi Olmasaydı Ödenecek KV Tutarı","1- 5  Puan İndirim ve 32/A VİO Uygulandıktan Sonra Tatbik Edilecek KV Oranı","1-5 Puan İndirim ve 32/A İndirimi Uygulandıktan Sonra Ödenecek  KV Tutarı","Yararlanılan Yatırıma Katkı Tutarı\n(32/A İnd. KV Nedeniyle Vazgeçilen Vergi Tutarı)","Ödenecek KV Tutarı"]
[null,"GENEL ORANA TABİ KISIM (DİĞER FAALİYETLER)",{"$f":"F93","v":0.33333333333333331},{"$f":"C119*C120","v":0},{"$f":"D120*$H$94","v":0},0,{"$f":"E120-F120","v":0},{"$f":"G120","v":0},{"$f":"($H$94)-(($H$94)*F82)","v":0.25},{"$f":"I120*D120","v":0},{"$f":"G120-J120","v":0},{"$f":"J123","v":0}]
[null,"1 PUAN İNDİRİMLİ ORANA TABİ KISIM  (İMALAT)",{"$f":"E93","v":0},{"$f":"C119*C121","v":0},{"$f":"D121*$H$94","v":0},{"$f":"D121/100","v":0},{"$f":"E121-F121","v":0},{"$f":"G121","v":0},{"$f":"($H$94-0.01)-(($H$94-0.01)*F82)","v":0.24},{"$f":"I121*D121","v":0},{"$f":"G121-J121","v":0}]
[null,"5 PUAN İNDİRİMLİ ORANA TABİ KISIM  ( İHRACAT)",{"$f":"D93","v":0.66666666666666663},{"$f":"C119*C122","v":0},{"$f":"D122*$H$94","v":0},{"$f":"D122/20","v":0},{"$f":"E122-F122","v":0},0,{"$f":"($H$94-0.05)-(($H$94-0.05)*F82)","v":0.2},0,{"$f":"G122-J122","v":0}]
[null,"TOPLAM",{"$f":"SUM(C120:C122)","v":1},0,0,{"$f":"SUM(F120:F122)","v":0},{"$f":"SUM(G120:G122)","v":0},{"$f":"SUM(H120:H122)","v":0},null,{"$f":"SUM(J120:J122)","v":0},0]
[null,"32/A UYGULANABİLECEK MATRAH (5.TEŞVİK BELGESİ)",{"$f":"G84","v":0},"KV MATRAHI","1 - 5 PUAN İNDİRİM OLMASAYDI HESAPLANAN KV TUTARI","1-5 Puan İndirim Tutarı","1 - 5 Puan İndirim Sonrasında Hesaplanan KV Tutarı","32/A İndirimi Olmasaydı Ödenecek KV Tutarı","1 -5 Puan İndirim ve 32/A VİO Uygulandıktan Sonra Tatbik Edilecek KV Oranı","1 - 5 Puan İndirim ve 32/A İndirimi Uygulandıktan Sonra Ödenecek  KV Tutarı","Yararlanılan Yatırıma Katkı Tutarı\n(32/A İnd. KV Nedeniyle Vazgeçilen Vergi Tutarı)","Ödenecek KV Tutarı"]
[null,"GENEL ORANA TABİ KISIM (DİĞER FAALİYETLER)",{"$f":"F93","v":0.33333333333333331},{"$f":"C124*C125","v":0},{"$f":"D125*$H$94","v":0},0,{"$f":"E125-F125","v":0},{"$f":"G125","v":0},{"$f":"($H$94)-(($H$94)*G82)","v":0.25},{"$f":"I125*D125","v":0},{"$f":"G125-J125","v":0},{"$f":"J128","v":0}]
[null,"1 PUAN İNDİRİMLİ ORANA TABİ KISIM  (İMALAT)",{"$f":"E93","v":0},{"$f":"C124*C126","v":0},{"$f":"D126*$H$94","v":0},{"$f":"D126/100","v":0},{"$f":"E126-F126","v":0},{"$f":"G126","v":0},{"$f":"($H$94-0.01)-(($H$94-0.01)*G82)","v":0.24},{"$f":"I126*D126","v":0},{"$f":"G126-J126","v":0}]
[null,"5 PUAN İNDİRİMLİ ORANA TABİ KISIM  ( İHRACAT)",{"$f":"D93","v":0.66666666666666663},{"$f":"C124*C127","v":0},{"$f":"D127*$H$94","v":0},{"$f":"D127/20","v":0},{"$f":"E127-F127","v":0},0,{"$f":"($H$94-0.05)-(($H$94-0.05)*G82)","v":0.2},0,{"$f":"G127-J127","v":0}]
[null,"TOPLAM",{"$f":"SUM(C125:C127)","v":1},0,0,{"$f":"SUM(F125:F127)","v":0},{"$f":"SUM(G125:G127)","v":0},{"$f":"SUM(H125:H127)","v":0},null,{"$f":"SUM(J125:J127)","v":0},0]
[null,"32/A UYGULANAMAYACAK MATRAH",{"$f":"IF(C85<=0,0,C85)","v":1200000},"KV MATRAHI","1-5 PUAN İNDİRİM OLMASAYDI HESAPLANAN KV TUTARI","1-5 Puan İndirim Tutarı","1 -5 Puan İndirim Sonrasında Hesaplanan KV Tutarı","32/A İNDİRİMİ UYGULANMAZ",null,"1 Puan İndirim ve 32/A İndirimi Uygulandıktan Sonra Ödenecek  KV Tutarı","Yararlanılan Yatırıma Katkı Tutarı\n(32/A İnd. KV Nedeniyle Vazgeçilen Vergi Tutarı)","Ödenecek KV Tutarı"]
[null,"GENEL ORANA TABİ KISIM (DİĞER FAALİYETLER)",{"$f":"F93","v":0.33333333333333331},{"$f":"C129*C130","v":400000},{"$f":"D130*$H$94","v":100000},0,{"$f":"E130-F130","v":100000},null,null,{"$f":"G130","v":100000},{"$f":"G130-J130","v":0},{"$f":"J133","v":260000}]
[null,"1 PUAN İNDİRİMLİ ORANA TABİ KISIM  (İMALAT)",{"$f":"E93","v":0},{"$f":"C131*C129","v":0},{"$f":"D131*$H$94","v":0},{"$f":"D131/100","v":0},{"$f":"E131-F131","v":0},null,null,{"$f":"G131","v":0},{"$f":"G131-J131","v":0}]
[null,"5 PUAN İNDİRİMLİ ORANA TABİ KISIM  ( İHRACAT)",{"$f":"D93","v":0.66666666666666663},{"$f":"C132*C129","v":800000},{"$f":"D132*$H$94","v":200000},{"$f":"D132/20","v":40000},{"$f":"E132-F132","v":160000},null,null,160000,0]
[null,"TOPLAM",{"$f":"SUM(C130:C132)","v":1},{"$f":"SUM(D130:D132)","v":1200000},300000,{"$f":"SUM(F130:F132)","v":40000},{"$f":"SUM(G130:G132)","v":260000},null,null,260000,0]
[null,"TOPLAM KV MATRAHI VE ÖDENMESİ GEREKEN KV ",{"$f":"C104+C129+C109+C114+C119+C124","v":1200000},{"$f":"D108+D133+D113+D118+D123+D128","v":1200000},{"$f":"E108+E133+E113+E118+E123+E128","v":300000},{"$f":"F108+F133+F113+F118+F123+F128","v":40000},{"$f":"G108+G133+G113+G118+G123+G128","v":260000},null,null,{"$f":"J108+J133+J113+J118+J123+J128","v":260000},{"$f":"K133+K108+K113+K118+K123+K128","v":0},{"$f":"L105+L130+L110+L115+L120+L125","v":260000}]
[]
[null,"GEÇİCİ VERGİ BEYANNMESİNDE MATRAH BİLDİRİMİ BÖLÜMÜNDE DOLDURULACAK KISIMLAR VE TUTARLARI"]
[null,"32 A Madde Kapsamında İndirimli Kurumlar Vergisine (Geçici Vergiye) Tabi Matrah",{"$f":"C104+C109+C114+C119+C124","v":0},{"$f":"E108+E113+E118+E123+E128","v":0},"1-5 Puan Olmasaydı Hesaplan KV Tutarı"]
[null,null,null,{"$f":"G108+G113+G118+G123++G128","v":0},"1 -5 Puan İndirim Sonrasında Ödenecek KV Tutarı\n (32 A olmasaydı hesaplanacak Vergi)"]
[null,null,null,{"$f":"K108+K113+K118+K123+K128","v":0},"32/A İndirimi ile Vazgeçilen Vergi"]
[null,"32 A Madde Kapsamında İndirimli Kurumlar Vergisi(Geçici Vergi) Oranı",{"$f":"IFERROR(D140/C137,0)","v":0},{"$f":"L105+L110+L115+L120+L125","v":0},"32/A ya Tabi Matrah Üzerinden Ödenecek KV"]
[null,"32/7 Madde Kapsamında İndirimli Kurumlar Vergisine (Geçici Vergiye) Tabi Matrah  (İhracat)",{"$f":"D132","v":800000},{"$f":"E132","v":200000},"5 Puan Olmasaydı Hesaplan KV Tutarı"]
[null,null,null,{"$f":"F132","v":40000},"5 Puan İndirimin Vergi Etkisi "]
[null,"32/7 Madde Kapsamında İndirimli Kurumlar Vergisi (Geçici Vergi) Oranı",{"$f":"IFERROR(D143/C141,0)","v":0.2},{"$f":"G132","v":160000},"5 Puan İndirim Sonrasında Ödenecek KV Tutarı (İhracat)\n"]
[null,"32/8 Madde Kapsamında İndirimli Kurumlar Vergisine (Geçici Vergiye) Tabi Matrah  (Üretim)",{"$f":"D131","v":0},{"$f":"E131","v":0},"1 Puan Olmasaydı Hesaplan KV Tutarı"]
[null,null,null,{"$f":"F131","v":0},"1 Puan İndirimin Vergi Etkisi "]
[null,"32/8 Madde Kapsamında İndirimli Kurumlar Vergisi (Geçici Vergi) Oranı",{"$f":"IFERROR(D146/C144,0)","v":0},{"$f":"G131","v":0},"1 Puan İndirim Sonrasında Ödenecek KV Tutarı (Üretim)\n"]
[null,"Genel Orana Tabi Matrah (Diğer)",{"$f":"D130","v":400000},{"$f":"J130","v":100000},"Diğer Faalilyetlerden Elde Edilen Kazanç"]
[null,null,{"$f":"IFERROR(D147/C147,0)","v":0.25}]
[null,"MATRAHLAR TOPLAMI",{"$f":"C137+C144+C141+C147","v":1200000},{"$f":"D140+D146+D143+D147","v":260000}]

{"sheet":"32-1-2-9-2 Ö","index":15,"n_rows":149,"n_cols":12,"rows_kept":149,"cut":false,"hidden":true,"merged":[[84,2,84,6],[1,1,2,1],[59,1,59,2],[60,1,60,2],[71,1,72,1],[73,1,73,2],[74,1,74,2],[74,3,74,4],[75,1,75,2],[75,3,75,4],[79,1,79,3],[82,2,82,6],[85,2,85,6],[87,1,89,1],[87,2,88,2],[87,3,88,3],[87,4,88,4],[87,5,88,5],[135,1,135,4],[137,1,138,2],[104,11,107,11],[109,11,112,11],[114,11,117,11],[119,11,122,11],[124,11,127,11],[128,7,133,8],[129,11,132,11]]}
[]
[null,"FAALİYET TÜRLERİ İTİBARİYLE HASILATLAR VE TOPLAM İÇİNDEKİ ORANLARI",{"$f":"IFERROR(C4/C4,0)","v":1},{"$f":"IFERROR(D4/C4,0)","v":0},{"$f":"IFERROR(E4/C4,0)","v":0.9375},{"$f":"IFERROR(F4/C4,0)","v":6.25E-2}]
[null,null,"Toplam Hasılat","İhracat faaliyeti","İmalat faaliyeti","Diğer faaliyetler"]
[null,"A-BRÜT SATIŞLAR (60)",{"$f":"D4+E4+F4","v":1600000},{"$f":"SUM(D5:D7)","v":0},{"$f":"SUM(E5:E7)","v":1500000},100000]
[null,"1-Yurtiçi Satışlar (600)",{"$f":"D5+E5+F5","v":700000},null,700000]
[null,"2-Yurtdışı Satışlar (601)",{"$f":"D6+E6+F6","v":0}]
[null,"3-Diğer Gelirler (602)",{"$f":"D7+E7+F7","v":900000},null,800000,100000]
[null,"B-SATIŞ İNDİRİMLERİ(-) (61)",{"$f":"SUM(C9:C11)","v":0},{"$f":"SUM(D9:D11)","v":0},{"$f":"SUM(E9:E11)","v":0},0]
[null,"1-Satıştan İadeler (-) (610)",{"$f":"SUM(D9:F9)","v":0}]
[null,"2- Satış İskontoları (-) (611)",{"$f":"SUM(D10:F10)","v":0}]
[null,"3-Diğer İndirimler (-) (612)",0]
[null,"C-NET SATIŞLAR",{"$f":"C4-C8","v":1600000},{"$f":"D4-D8","v":0},{"$f":"E4-E8","v":1500000},100000]
[null,"D-SATIŞLARIN MALİYETİ (-) (62)",{"$f":"SUM(C14:C17)","v":0},{"$f":"SUM(D14:D17)","v":0},{"$f":"SUM(E14:E17)","v":0},{"$f":"SUM(F14:F17)","v":0}]
[null,"1-Satılan Mamuller Maliyeti ( 620)",{"$f":"SUM(D14:F14)","v":0}]
[null,"2-Satılan Ticari Mal Maliyeti (621)",{"$f":"SUM(D15:F15)","v":0}]
[null,"3-Satılan Hizmet Maliyeti (622)",0]
[null,"4-Diğer Satışların Maliyeti (623)",0]
[null,"BRÜT SATIŞ KARI / ZARARI",{"$f":"C12-C13","v":1600000},{"$f":"D12-D13","v":0},{"$f":"E12-E13","v":1500000},100000]
[null,"E-FAALİYET GİDERLERİ (-) (63)",{"$f":"SUM(C20:C24)","v":0},{"$f":"SUM(D20:D24)","v":0},{"$f":"SUM(E20:E24)","v":0},0]
[null,"1-Araştırma ve Geliştirme Giderleri(-) (630)",{"$f":"SUM(D20:F20)","v":0}]
[null,"2-Pazarlama, Satış ve Dağıtım Giderleri(-) (631)",{"$f":"SUM(D21:F21)","v":0}]
[null,"3-Genel Yönetim Giderleri(-) (632)",{"$f":"SUM(D22:F22)","v":0}]
[null,"MÜŞTEREK GENEL GİDERLER (DAĞITIM-HASILAT PAYINA GÖRE)",null,{"$f":"C23*D2","v":0},{"$f":"C23*E2","v":0},{"$f":"C23*F2","v":0}]
[null,"MÜŞTEREK GENEL GİDER GİBİ DAĞITIMA TABİ TUTULACAK AMORTİSMAN GİDERLERİ  (DAĞITIM-HASILAT PAYINA GÖRE)",null,{"$f":"C24*D2","v":0},{"$f":"C24*E2","v":0},{"$f":"C24*F2","v":0}]
[null,"FAALİYET KARI / ZARARI ",{"$f":"C18-C19","v":1600000},{"$f":"D18-D19","v":0},{"$f":"E18-E19","v":1500000},100000]
[null,"F-DİĞER FAALİYETLERDEN OLAĞAN GELİR VE KARLAR (64)",{"$f":"SUM(C27:C35)","v":0},{"$f":"SUM(D27:D35)","v":0},{"$f":"SUM(E27:E35)","v":0},{"$f":"SUM(F27:F35)","v":0}]
[null,"         1- İŞTİRAKLERDEN TEMETTÜ GELİRLERİ (640)",{"$f":"SUM(D27:F27)","v":0}]
[null,"         2- BAĞLI ORTAKLIKLARDAN TEMETTÜ GELİRLERİ (641)",{"$f":"SUM(D28:F28)","v":0}]
[null,"         3- FAİZ GELİRLERİ (642) (ihracat ve imalat kaynaklı alacağın tahsiline kadar olan süreçte oluşan)",0]
[null,"         4- KOMİSYON GELİRLERİ (643)",0]
[null,"         5- KONUSU OLMAYAN KARŞILIKLAR (644)",0]
[null,"         6- MENKUL KIYMET SATIŞ KARLARI (645)",0]
[null,"         7- KAMBİYO KARLARI (646) (ihracat ve imalat kaynaklı alacağın tahsiline kadar olan süreçte oluşan)",0]
[null,"         8- REESKONT FAİZ GELİRLERİ (647)",0]
[null,"         9- FAALİYETLE İLGİLİ DİĞER GELİR VE KARLAR (649)",0]
[null,"ARA TOPLAM",{"$f":"C25+C26","v":1600000},{"$f":"D25+D26","v":0},{"$f":"E25+E26","v":1500000},{"$f":"F25+F26","v":100000}]
[null,"G-DİĞER FAALİYETLERDEN OLAĞAN GİDER VE ZARARLAR(-) (65)",{"$f":"SUM(C38:C43)","v":0},{"$f":"SUM(D38:D43)","v":0},{"$f":"SUM(E38:E43)","v":0},0]
[null,"         1- KOMİSYON GİDERLERİ (653)",{"$f":"SUM(D38:F38)","v":0}]
[null,"         2- KARŞILIK GİDERLERİ (654)",{"$f":"SUM(D39:F39)","v":0}]
[null,"         3- MENKUL KIYMET SATIŞ ZARARLARI (655)",0]
[null,"         4- KAMBİYO ZARARLARI (656) (ihracat ve imalat kaynaklı alacağın tahsiline kadar olan süreçte oluşan)",0]
[null,"         5- REESKONT FAİZ GİDERLERİ (657)",0]
[null,"         6- DİĞER OLAĞAN GİDER VE ZARARLAR (659)",{"$f":"SUM(D43:F43)","v":0}]
[null,"ARA TOPLAM",{"$f":"C36-C37","v":1600000},{"$f":"D36-D37","v":0},{"$f":"E36-E37","v":1500000},100000]
[null,"H-FİNANSMAN GİDERLERİ(-) (66)",{"$f":"SUM(C46:C49)","v":0},{"$f":"SUM(D46:D49)","v":0},{"$f":"SUM(E46:E49)","v":0},{"$f":"SUM(F46:F49)","v":0}]
[null,"         1- KISA VADELİ BORÇLANMA GİDERLERİ (-)",{"$f":"SUM(D46:F46)","v":0}]
[null,"         2- UZUN VADELİ BORÇLANMA GİDERLERİ (-)",{"$f":"SUM(D47:F47)","v":0}]
[null,"         1- KISA VADELİ BORÇLANMA GİDERLERİ (-) (DAĞITIM)",null,{"$f":"C48*D2","v":0},{"$f":"C48*E2","v":0},{"$f":"C48*F2","v":0}]
[null,"         2- UZUN VADELİ BORÇLANMA GİDERLERİ (-) (DAĞITIM)",null,{"$f":"C49*D2","v":0},{"$f":"C49*E2","v":0},{"$f":"C49*F2","v":0}]
[null,"ARA TOPLAM",{"$f":"C44-C45","v":1600000},{"$f":"D44-D45","v":0},{"$f":"E44-E45","v":1500000},{"$f":"F44-F45","v":100000}]
[null,"I-OLAĞANDIŞI GELİR VE KÂRLAR (67)",{"$f":"SUM(D51:F51)","v":0},{"$f":"SUM(D52:D53)","v":0},{"$f":"SUM(E52:E53)","v":0},{"$f":"SUM(F52:F53)","v":0}]
[null,"1- ÖNCEKİ DÖNEM GELİR VE KARLARI (671)",{"$f":"SUM(D52:F52)","v":0}]
[null,"2-DİĞER OLAĞAN DIŞI GELİR VE KARLAR (679)",{"$f":"SUM(D53:F53)","v":0}]
[null,"ARA TOPLAM",{"$f":"SUM(D54:F54)","v":1600000},{"$f":"D50+D51","v":0},{"$f":"E50+E51","v":1500000},100000]
[null,"J-OLAĞANDIŞI GİDER VE ZARARLAR(-) (68)",{"$f":"SUM(C56:C58)","v":0},{"$f":"SUM(D56:D58)","v":0},{"$f":"SUM(E56:E58)","v":0},0]
[null,"1-Çalışmayan Kısım Gider ve Zararları(-) (680)",{"$f":"SUM(D56:F56)","v":0}]
[null,"2-Önceki Dönem Gider ve Zararları(-) (681)",{"$f":"SUM(D57:F57)","v":0}]
[null,"3-Diğer Olağan Dışı Gider ve Zararlar(-) (689)",0]
[null,"DÖNEM KÂRI VEYA ZARARI \n(TİCARİ BİLANÇO KARI ZARARI )",{"$f":"C54-C55","v":1600000},{"$f":"D54-D55","v":0},{"$f":"E54-E55","v":1500000},100000]
[null,"İHRACAT, İMALAT VE DİĞER FAALİYETLERDEN ELDE EDİLEN KAZANCIN TOPLAM TİCARİ KAZANÇ İÇİNDEKİ PAYLARI  \n\n(Kazançlar arasında Öncelik İhracat Kazancına Verilmiştir. İhrcat Kazancından arta kalan Ticari Kazanç İmalat ve Diğer Faaliyetlere Sayılmıştır.)\n\n",null,{"$f":"IF(D59>=$C$59,1,\n    IF(D59<=0,0,\n    IF(AND(D59>0,D59<$C$59),D59/$C$59)))","v":0},{"$f":"IF(E59>=$C$59,1,\n    IF(E59<=0,0,\n    IF(AND(E59>0,E59<$C$59),E59/$C$59)))","v":0.9375},{"$f":"IF(F59>=$C$59,1,\n    IF(F59<=0,0,\n    IF(AND(F59>0,F59<$C$59),F59/$C$59)))","v":6.25E-2}]
[null,null,null,{"$f":"D60/(D60+E60+F60)","v":0},{"$f":"E60/(D60+E60+F60)","v":0.9375},{"$f":"F60/(D60+E60+F60)","v":6.25E-2}]
[]
[null,"KKEG +",400000]
[null," KABUL EDİLMEYEN GELİRLER -"]
[null,"ZARAR OLSA DAHİ İNDİRİLECEK İSTİSNALAR -",{"$f":"C66+C67+C68","v":700000}]
[null,"Hizmet İhracatı Faaliyetinden (KVK 10-1/ğ) Elde Edilen Kazançlardan İstisna Edilenlerin Toplamı"]
[null,"İmalat Faaliyetinden Elde Edilen Kazançlardan İstisna Edilenlerin Toplamı",700000]
[null,"Diğer Faaliyetlerden Elde Edilen Kazançlardan İstisna Edilenlerin Toplamı"]
[null,"GEÇMİŞ YIL ZARARLARI -",300000]
[null,"İNDİRİMLER -",null,"AZAMİ YAZILABİLECEK İNDİRİMLER TUTARI",{"$f":"C59+C63-C64-C65-C69","v":1000000}]
[]
[null,"1 PUAN İNDİRİM UYGULANACAK TUTARIN HESABINDA İSTİSNA KAZANÇLAR DÜŞÜLDÜKTEN SONRA BULUNAN TİCARİ KAZANÇ TUTARI İLE  İHRACAT,İMALAT VE DİĞER KAZANÇLARIN TUTARI","TİCARİ KAZANÇ TAN İhracat ve İmalat Kazancından İstisna Olan Tutarlar Düşüldükten Sonra Kalan Tutarı","İhracat Faaliyetinden Elde Edilen  Kazançtan İstisna Olan Kısım Düşüldükten Sonra Bulunan Tutarı","Üretim  Faaliyetinden Elde Edilen  Kazançtan İstisna Olan Kısım Düşüldükten Sonra Bulunan Tutarı","Diğer Faaliyetinden Elde Edilen  Kazanç"]
[null,null,{"$f":"IF(C59-C66-C67<=0,0,C59-C66-C67)","v":900000},{"$f":"IF( $D$59-C66<=0,0,MIN($D$59-C66,$C$73*D61))","v":0},{"$f":"IF($E$59-C67<=0,0,MIN($E$59-C67,$C$73*E61))","v":800000},{"$f":"IF(C73-D73-E73<=0,0,C73-D73-E73)","v":100000}]
[null,"MATRAH DAĞITIM PAYLARI",null,{"$f":"IFERROR(IF(D73/C73<=0,0,D73/C73),0)","v":0},{"$f":"IFERROR(IF(E73/C73<=0,0,E73/C73),0)","v":0.88888888888888884},{"$f":"IFERROR(F73/C73,0)","v":0.1111111111111111}]
[null,"İHRACAT, İMALAT VE DİĞER FAALİYETLERDEN ELDE EDİLEN KAZANCIN TOPLAM TİCARİ KAZANÇ İÇİNDEKİ PAYLARI ",null,{"$f":"IFERROR(IF(AND(D73+E73>C73, F73<=0),1,(D73+E73)/C73),0)","v":0.88888888888888884},null,{"$f":"IFERROR(IF(F73<=0,0,F73/C73),0)","v":0.1111111111111111}]
[null,"NEGATİF VE % 100 DEN BÜYÜKLÜK KONTROLÜ SONRASINDAKİ PAYLARI",null,{"$f":"IFERROR(IF(D75<=0,0,IF(D75>1,1,D75)),0)","v":0.88888888888888884},null,{"$f":"IFERROR(IF(F75<=0,0,IF(F75>1,1,F75)),0)","v":0.1111111111111111}]
[]
[null,"SAFİ KURUM KAZANCI \n(KURUMLAR VERGİSİ MATRAHI)",{"$f":"C59+C63-C64-C65-C69-C70","v":1000000},{"$f":"IF(C78<0, \"ZARAR\",\"KAR\")","v":"KAR"}]
[]
[null,"2022 YILI 3. DÖNEM İNDİRİMLİ KURUMLAR VERGİSİ HESAPLAMA TABLOSU"]
[null,null,"1. TEŞVİK BELGESİ","2. TEŞVİK BELGESİ","3. TEŞVİK BELGESİ","4. TEŞVİK BELGESİ","5. TEŞVİK BELGESİ"]
[null,"Vergi İndirim Oranı (VİO)"]
[null,"KV MATRAHI (Safi Kurum Kazancı)",{"$f":"C78","v":1000000}]
[null,"32/A  Uygulanacak K.V. Matrahı (HER BİR TEŞVİK BELGESİ KAPSAMINDA YARARLANILABİLECEK YATIRIMA KATKI TUTARININ MATRAHI BU HÜCRELERE YAZILMALIDIR)",null,null,null,null,null,{"$f":"IF(SUM(C84:G84)>C78,\"32/A İNDİRİMİ UYGULANACAK KAZANÇ, SAFİ KURUM KAZANCINDAN FAZLADIR\",SUM(C84:G84))","v":0}]
[null,"32/A UYGULANMAYACAK K.V.  Matrahı",{"$f":"IF(C83-(C84+D84+E84+F84+G84)<0,0,C83-(C84+D84+E84+F84+G84))","v":1000000}]
[null,"MATRAH TOPLAMI",{"$f":"IF((C84+D84+E84+F84+G84+C85)>C78,C78,(C84+D84+E84+F84+G84+C85))","v":1000000}]
[]
[null,"SAFİ KURUM KAZANCININ  KV VERGİ ORANLARI İTİBARİYLE DAĞILIMI ","TOPLAM SAFİ KAZANÇ","İhracat Kazancı Payı","Üretim Kazancı Payı","Diğer Faaliyet Kazancı Payı"]
[]
[null,null,{"$f":"C78","v":1000000},{"$f":"IF(AND(AND($D$59>0,($D$59+$E$59)>=$C$59,D59>=C66),$C$90>=MAX(D59,D73)),\n\nMIN(MAX(IF(D59<=C90,D59,IF(D73<=C90,D73)),$C$90*D74)),\n\nIF(OR(D59<=0,D73<=0),0,\n\nMIN( MAX(   MAX(   IF(D59<=C90,D59),  IF(D73<=C90,D73) ),    MIN($C$90*D74,D59,D73)),$C$90)))","v":0},{"$f":"MIN( IF(AND(AND($E$59>0,($D$59+$E$59)>=$C$59,E59>=C67),$C$90>=MAX(E59,E73)),\n\nMIN(MAX(IF(E59<=C90,E59,IF(E73<=C90,E73)),$C$90*E74)),\n\nIF(OR(E59<=0,E73<=0),0,\n\nMIN( MAX(   MAX(   IF(E59<=C90,E59),  IF(E73<=C90,E73) ),    MIN($C$90*E74,E59,E73)),$C$90))),C90-D90)","v":800000},{"$f":"C90-D90-E90","v":200000}]
[null,"SAFİ KURUM KAZANCININ DAĞILIMI ORANSAL DAĞILIMI",{"$f":"C90","v":1000000},{"$f":"D90/C90","v":0},{"$f":"E90/C90","v":0.8},{"$f":"F90/C90","v":0.2}]
[null,"SAFİ KURUM KAZANCININ DAĞILIMI TUTARSAL",{"$f":"C91","v":1000000},{"$f":"D90","v":0},{"$f":"E90","v":800000},{"$f":"F90","v":200000}]
[null,"SAFİ KURUM KAZANCI DAĞILIMI",{"$f":"C92","v":1000000},{"$f":"IFERROR(IF(D92/C92>=1,1,D92/C92),0)","v":0},{"$f":"IFERROR(IF(E92/C92>=1,1,E92/C92),0)","v":0.8},{"$f":"IFERROR(IF(F92/C92>=1,1,F92/C92),0)","v":0.2},null,"KV ORANI"]
[null,"1 PUAN VE 32/A İNDİRİMİ OLMASAYDI HESAPLANAN KV TUTARI",{"$f":"C93*$H$94","v":250000},{"$f":"D92*$H$94","v":0},{"$f":"E92*$H$94","v":200000},{"$f":"F92*$H$94","v":50000},null,0.25]
[null,"32/ A UYGULANAN MATRAH",{"$f":"C84+D84+E84+F84+G84","v":0},{"$f":"D107+D112+D117+D122+D127","v":0},{"$f":"D106+D111+D116+D121+D126","v":0},{"$f":"D105+D110+D115+D120+D125","v":0}]
[null,"32/A UYGULANACAK MATRAH ÜZERİNDEN ÖDENECEK KV TUTARI",{"$f":"J108+J113+J118+J123+J128","v":0},{"$f":"J107+J112+J117+J122+J127","v":0},{"$f":"J106+J111+J116+J121+J126","v":0},{"$f":"J105+J110+J115+J120+J125","v":0}]
[null,"32/A UYGULANMAYAN MATRAH",{"$f":"IF(C85<=0,0,C85)","v":1000000},{"$f":"D132","v":0},{"$f":"D131","v":800000},{"$f":"D130","v":200000}]
[null,"32/A UYGULANMAYAN MATRAH ÜZERİNDEN ÖDENECEK KV TUTARI",{"$f":"L130","v":242000},{"$f":"J132","v":0},{"$f":"J131","v":192000},{"$f":"J130","v":50000}]
[null,"TOPLAM ÖDENECEK KV",{"$f":"C96+C98","v":242000},{"$f":"J132+J107","v":0},{"$f":"J131+J106","v":192000},{"$f":"J130+J105","v":50000}]
[null,"TOPLAM AVANTAJ  (YARARLANILAN 1 PUAN İNDİRİMİ + 32/A İNDİRİMİ TUTARI )",{"$f":"C94-C99","v":8000},{"$f":"D101+D102","v":0},{"$f":"E101+E102","v":8000},{"$f":"F101+F102","v":0}]
[null,"YARARLANILAN 1 - 5 PUAN İNDİRİMİ TUTARI",{"$f":"F133+F128+F123+F118+F113+F108","v":8000},{"$f":"F132+F107+F112+F117+F122+F127","v":0},{"$f":"F131+F106+F111+F116+F121+F126","v":8000},{"$f":"F130+F105+F110+F115+F120+F125","v":0}]
[null,"YARLANILAN 32/A İNDİRİMİ TUTARI",{"$f":"K108+K113+K118+K123+K128+K133","v":0},{"$f":"K107+K112+K122+K127+K132","v":0},{"$f":"K106+K111+K116+K121+K126+K131","v":0},{"$f":"K105++K110+K115+K120+K125+K130","v":0}]
[]
[null,"32/A UYGULANABİLECEK MATRAH (1.TEŞVİK BELGESİ)",{"$f":"C84","v":0},"KV MATRAHI","1 - 5 PUAN İNDİRİM OLMASAYDI HESAPLANAN KV TUTARI","1 -5 Puan İndirim Tutarı","1 - 5 Puan İndirim Sonrasında Hesaplanan KV Tutarı","32/A İndirimi Olmasaydı Ödenecek KV Tutarı","1 -5 Puan İndirim ve 32/A VİO Uygulandıktan Sonra Tatbik Edilecek KV Oranı","1 -5 Puan İndirim ve 32/A İndirimi Uygulandıktan Sonra Ödenecek  KV Tutarı","Yararlanılan Yatırıma Katkı Tutarı\n(32/A İnd. KV Nedeniyle Vazgeçilen Vergi Tutarı)","Ödenecek KV Tutarı"]
[null,"GENEL ORANA TABİ KISIM (DİĞER FAALİYETLER)",{"$f":"F93","v":0.2},{"$f":"C104*C105","v":0},{"$f":"D105*$H$94","v":0},0,{"$f":"E105-F105","v":0},{"$f":"G105","v":0},{"$f":"($H$94)-(($H$94)*$C$82)","v":0.25},{"$f":"I105*D105","v":0},{"$f":"G105-J105","v":0},{"$f":"J108","v":0}]
[null,"1 PUAN İNDİRİMLİ ORANA TABİ KISIM  (İMALAT)",{"$f":"E93","v":0.8},{"$f":"C104*C106","v":0},{"$f":"D106*$H$94","v":0},{"$f":"D106/100","v":0},{"$f":"E106-F106","v":0},{"$f":"G106","v":0},{"$f":"($H$94-0.01)-(($H$94-0.01)*$C$82)","v":0.24},{"$f":"I106*D106","v":0},{"$f":"G106-J106","v":0}]
[null,"5 PUAN İNDİRİMLİ ORANA TABİ KISIM  ( İHRACAT)",{"$f":"D93","v":0},{"$f":"C104*C107","v":0},{"$f":"D107*$H$94","v":0},{"$f":"D107/20","v":0},{"$f":"E107-F107","v":0},0,{"$f":"($H$94-0.05)-(($H$94-0.05)*C82)","v":0.2},0,{"$f":"G107-J107","v":0}]
[null,"TOPLAM",{"$f":"SUM(C105:C107)","v":1},{"$f":"SUM(D105:D107)","v":0},0,{"$f":"SUM(F105:F107)","v":0},{"$f":"SUM(G105:G107)","v":0},{"$f":"SUM(H105:H107)","v":0},null,0,0]
[null,"32/A UYGULANABİLECEK MATRAH (2.TEŞVİK BELGESİ)",{"$f":"D84","v":0},"KV MATRAHI","1 - 5 PUAN İNDİRİM OLMASAYDI HESAPLANAN KV TUTARI","1 -5 Puan İndirim Tutarı","1 -5 Puan İndirim Sonrasında Hesaplanan KV Tutarı","32/A İndirimi Olmasaydı Ödenecek KV Tutarı","1 - 5 Puan İndirim ve 32/A VİO Uygulandıktan Sonra Tatbik Edilecek KV Oranı","1-5  Puan İndirim ve 32/A İndirimi Uygulandıktan Sonra Ödenecek  KV Tutarı","Yararlanılan Yatırıma Katkı Tutarı\n(32/A İnd. KV Nedeniyle Vazgeçilen Vergi Tutarı)","Ödenecek KV Tutarı"]
[null,"GENEL ORANA TABİ KISIM (DİĞER FAALİYETLER)",{"$f":"F93","v":0.2},{"$f":"C109*C110","v":0},{"$f":"D110*$H$94","v":0},0,{"$f":"E110-F110","v":0},{"$f":"G110","v":0},{"$f":"($H$94)-(($H$94)*D82)","v":0.25},{"$f":"I110*D110","v":0},{"$f":"G110-J110","v":0},{"$f":"J113","v":0}]
[null,"1 PUAN İNDİRİMLİ ORANA TABİ KISIM  (İMALAT)",{"$f":"E93","v":0.8},{"$f":"C109*C111","v":0},{"$f":"D111*$H$94","v":0},{"$f":"D111/100","v":0},{"$f":"E111-F111","v":0},{"$f":"G111","v":0},{"$f":"($H$94-0.01)-(($H$94-0.01)*D82)","v":0.24},{"$f":"I111*D111","v":0},{"$f":"G111-J111","v":0}]
[null,"5 PUAN İNDİRİMLİ ORANA TABİ KISIM  ( İHRACAT)",{"$f":"D93","v":0},{"$f":"C109*C112","v":0},{"$f":"D112*$H$94","v":0},{"$f":"D112/20","v":0},{"$f":"E112-F112","v":0},0,{"$f":"($H$94-0.05)-(($H$94-0.05)*D82)","v":0.2},0,{"$f":"G112-J112","v":0}]
[null,"TOPLAM",{"$f":"SUM(C110:C112)","v":1},0,0,{"$f":"SUM(F110:F112)","v":0},{"$f":"SUM(G110:G112)","v":0},{"$f":"SUM(H110:H112)","v":0},null,{"$f":"SUM(J110:J112)","v":0},0]
[null,"32/A UYGULANABİLECEK MATRAH (3.TEŞVİK BELGESİ)",{"$f":"E84","v":0},"KV MATRAHI","1 - 5 PUAN İNDİRİM OLMASAYDI HESAPLANAN KV TUTARI","1-5 Puan İndirim Tutarı","1 - 5 Puan İndirim Sonrasında Hesaplanan KV Tutarı","32/A İndirimi Olmasaydı Ödenecek KV Tutarı","1 - 5 Puan İndirim ve 32/A VİO Uygulandıktan Sonra Tatbik Edilecek KV Oranı","1 -5 Puan İndirim ve 32/A İndirimi Uygulandıktan Sonra Ödenecek  KV Tutarı","Yararlanılan Yatırıma Katkı Tutarı\n(32/A İnd. KV Nedeniyle Vazgeçilen Vergi Tutarı)","Ödenecek KV Tutarı"]
[null,"GENEL ORANA TABİ KISIM (DİĞER FAALİYETLER)",{"$f":"F93","v":0.2},{"$f":"C114*C115","v":0},{"$f":"D115*$H$94","v":0},0,{"$f":"E115-F115","v":0},{"$f":"G115","v":0},{"$f":"($H$94)-(($H$94)*E82)","v":0.25},{"$f":"I115*D115","v":0},{"$f":"G115-J115","v":0},{"$f":"J118","v":0}]
[null,"1 PUAN İNDİRİMLİ ORANA TABİ KISIM  (İMALAT)",{"$f":"E93","v":0.8},{"$f":"C114*C116","v":0},{"$f":"D116*$H$94","v":0},{"$f":"D116/100","v":0},{"$f":"E116-F116","v":0},{"$f":"G116","v":0},{"$f":"($H$94-0.01)-(($H$94-0.01)*E82)","v":0.24},{"$f":"I116*D116","v":0},{"$f":"G116-J116","v":0}]
[null,"5 PUAN İNDİRİMLİ ORANA TABİ KISIM  ( İHRACAT)",{"$f":"D93","v":0},{"$f":"C114*C117","v":0},{"$f":"D117*$H$94","v":0},{"$f":"D117/20","v":0},{"$f":"E117-F117","v":0},0,{"$f":"($H$94-0.05)-(($H$94-0.05)*E82)","v":0.2},0,{"$f":"G117-J117","v":0}]
[null,"TOPLAM",{"$f":"SUM(C115:C117)","v":1},0,0,{"$f":"SUM(F115:F117)","v":0},{"$f":"SUM(G115:G117)","v":0},{"$f":"SUM(H115:H117)","v":0},null,{"$f":"SUM(J115:J117)","v":0},0]
[null,"32/A UYGULANABİLECEK MATRAH (4. TEŞVİK BELGESİ)",{"$f":"F84","v":0},"KV MATRAHI","1 - 5 PUAN İNDİRİM OLMASAYDI HESAPLANAN KV TUTARI","1-5 Puan İndirim Tutarı","1 -5 Puan İndirim Sonrasında Hesaplanan KV Tutarı","32/A İndirimi Olmasaydı Ödenecek KV Tutarı","1- 5  Puan İndirim ve 32/A VİO Uygulandıktan Sonra Tatbik Edilecek KV Oranı","1-5 Puan İndirim ve 32/A İndirimi Uygulandıktan Sonra Ödenecek  KV Tutarı","Yararlanılan Yatırıma Katkı Tutarı\n(32/A İnd. KV Nedeniyle Vazgeçilen Vergi Tutarı)","Ödenecek KV Tutarı"]
[null,"GENEL ORANA TABİ KISIM (DİĞER FAALİYETLER)",{"$f":"F93","v":0.2},{"$f":"C119*C120","v":0},{"$f":"D120*$H$94","v":0},0,{"$f":"E120-F120","v":0},{"$f":"G120","v":0},{"$f":"($H$94)-(($H$94)*F82)","v":0.25},{"$f":"I120*D120","v":0},{"$f":"G120-J120","v":0},{"$f":"J123","v":0}]
[null,"1 PUAN İNDİRİMLİ ORANA TABİ KISIM  (İMALAT)",{"$f":"E93","v":0.8},{"$f":"C119*C121","v":0},{"$f":"D121*$H$94","v":0},{"$f":"D121/100","v":0},{"$f":"E121-F121","v":0},{"$f":"G121","v":0},{"$f":"($H$94-0.01)-(($H$94-0.01)*F82)","v":0.24},{"$f":"I121*D121","v":0},{"$f":"G121-J121","v":0}]
[null,"5 PUAN İNDİRİMLİ ORANA TABİ KISIM  ( İHRACAT)",{"$f":"D93","v":0},{"$f":"C119*C122","v":0},{"$f":"D122*$H$94","v":0},{"$f":"D122/20","v":0},{"$f":"E122-F122","v":0},0,{"$f":"($H$94-0.05)-(($H$94-0.05)*F82)","v":0.2},0,{"$f":"G122-J122","v":0}]
[null,"TOPLAM",{"$f":"SUM(C120:C122)","v":1},0,0,{"$f":"SUM(F120:F122)","v":0},{"$f":"SUM(G120:G122)","v":0},{"$f":"SUM(H120:H122)","v":0},null,{"$f":"SUM(J120:J122)","v":0},0]
[null,"32/A UYGULANABİLECEK MATRAH (5.TEŞVİK BELGESİ)",{"$f":"G84","v":0},"KV MATRAHI","1 - 5 PUAN İNDİRİM OLMASAYDI HESAPLANAN KV TUTARI","1-5 Puan İndirim Tutarı","1 - 5 Puan İndirim Sonrasında Hesaplanan KV Tutarı","32/A İndirimi Olmasaydı Ödenecek KV Tutarı","1 -5 Puan İndirim ve 32/A VİO Uygulandıktan Sonra Tatbik Edilecek KV Oranı","1 - 5 Puan İndirim ve 32/A İndirimi Uygulandıktan Sonra Ödenecek  KV Tutarı","Yararlanılan Yatırıma Katkı Tutarı\n(32/A İnd. KV Nedeniyle Vazgeçilen Vergi Tutarı)","Ödenecek KV Tutarı"]
[null,"GENEL ORANA TABİ KISIM (DİĞER FAALİYETLER)",{"$f":"F93","v":0.2},{"$f":"C124*C125","v":0},{"$f":"D125*$H$94","v":0},0,{"$f":"E125-F125","v":0},{"$f":"G125","v":0},{"$f":"($H$94)-(($H$94)*G82)","v":0.25},{"$f":"I125*D125","v":0},{"$f":"G125-J125","v":0},{"$f":"J128","v":0}]
[null,"1 PUAN İNDİRİMLİ ORANA TABİ KISIM  (İMALAT)",{"$f":"E93","v":0.8},{"$f":"C124*C126","v":0},{"$f":"D126*$H$94","v":0},{"$f":"D126/100","v":0},{"$f":"E126-F126","v":0},{"$f":"G126","v":0},{"$f":"($H$94-0.01)-(($H$94-0.01)*G82)","v":0.24},{"$f":"I126*D126","v":0},{"$f":"G126-J126","v":0}]
[null,"5 PUAN İNDİRİMLİ ORANA TABİ KISIM  ( İHRACAT)",{"$f":"D93","v":0},{"$f":"C124*C127","v":0},{"$f":"D127*$H$94","v":0},{"$f":"D127/20","v":0},{"$f":"E127-F127","v":0},0,{"$f":"($H$94-0.05)-(($H$94-0.05)*G82)","v":0.2},0,{"$f":"G127-J127","v":0}]
[null,"TOPLAM",{"$f":"SUM(C125:C127)","v":1},0,0,{"$f":"SUM(F125:F127)","v":0},{"$f":"SUM(G125:G127)","v":0},{"$f":"SUM(H125:H127)","v":0},null,{"$f":"SUM(J125:J127)","v":0},0]
[null,"32/A UYGULANAMAYACAK MATRAH",{"$f":"IF(C85<=0,0,C85)","v":1000000},"KV MATRAHI","1-5 PUAN İNDİRİM OLMASAYDI HESAPLANAN KV TUTARI","1-5 Puan İndirim Tutarı","1 -5 Puan İndirim Sonrasında Hesaplanan KV Tutarı","32/A İNDİRİMİ UYGULANMAZ",null,"1 Puan İndirim ve 32/A İndirimi Uygulandıktan Sonra Ödenecek  KV Tutarı","Yararlanılan Yatırıma Katkı Tutarı\n(32/A İnd. KV Nedeniyle Vazgeçilen Vergi Tutarı)","Ödenecek KV Tutarı"]
[null,"GENEL ORANA TABİ KISIM (DİĞER FAALİYETLER)",{"$f":"F93","v":0.2},{"$f":"C129*C130","v":200000},{"$f":"D130*$H$94","v":50000},0,{"$f":"E130-F130","v":50000},null,null,{"$f":"G130","v":50000},{"$f":"G130-J130","v":0},{"$f":"J133","v":242000}]
[null,"1 PUAN İNDİRİMLİ ORANA TABİ KISIM  (İMALAT)",{"$f":"E93","v":0.8},{"$f":"C131*C129","v":800000},{"$f":"D131*$H$94","v":200000},{"$f":"D131/100","v":8000},{"$f":"E131-F131","v":192000},null,null,{"$f":"G131","v":192000},{"$f":"G131-J131","v":0}]
[null,"5 PUAN İNDİRİMLİ ORANA TABİ KISIM  ( İHRACAT)",{"$f":"D93","v":0},{"$f":"C132*C129","v":0},{"$f":"D132*$H$94","v":0},{"$f":"D132/20","v":0},{"$f":"E132-F132","v":0},null,null,0,0]
[null,"TOPLAM",{"$f":"SUM(C130:C132)","v":1},{"$f":"SUM(D130:D132)","v":1000000},250000,{"$f":"SUM(F130:F132)","v":8000},{"$f":"SUM(G130:G132)","v":242000},null,null,242000,0]
[null,"TOPLAM KV MATRAHI VE ÖDENMESİ GEREKEN KV ",{"$f":"C104+C129+C109+C114+C119+C124","v":1000000},{"$f":"D108+D133+D113+D118+D123+D128","v":1000000},{"$f":"E108+E133+E113+E118+E123+E128","v":250000},{"$f":"F108+F133+F113+F118+F123+F128","v":8000},{"$f":"G108+G133+G113+G118+G123+G128","v":242000},null,null,{"$f":"J108+J133+J113+J118+J123+J128","v":242000},{"$f":"K133+K108+K113+K118+K123+K128","v":0},{"$f":"L105+L130+L110+L115+L120+L125","v":242000}]
[]
[null,"GEÇİCİ VERGİ BEYANNMESİNDE MATRAH BİLDİRİMİ BÖLÜMÜNDE DOLDURULACAK KISIMLAR VE TUTARLARI"]
[null,"32 A Madde Kapsamında İndirimli Kurumlar Vergisine (Geçici Vergiye) Tabi Matrah",{"$f":"C104+C109+C114+C119+C124","v":0},{"$f":"E108+E113+E118+E123+E128","v":0},"1-5 Puan Olmasaydı Hesaplan KV Tutarı"]
[null,null,null,{"$f":"G108+G113+G118+G123++G128","v":0},"1 -5 Puan İndirim Sonrasında Ödenecek KV Tutarı\n (32 A olmasaydı hesaplanacak Vergi)"]
[null,null,null,{"$f":"K108+K113+K118+K123+K128","v":0},"32/A İndirimi ile Vazgeçilen Vergi"]
[null,"32 A Madde Kapsamında İndirimli Kurumlar Vergisi(Geçici Vergi) Oranı",{"$f":"IFERROR(D140/C137,0)","v":0},{"$f":"L105+L110+L115+L120+L125","v":0},"32/A ya Tabi Matrah Üzerinden Ödenecek KV"]
[null,"32/7 Madde Kapsamında İndirimli Kurumlar Vergisine (Geçici Vergiye) Tabi Matrah  (İhracat)",{"$f":"D132","v":0},{"$f":"E132","v":0},"5 Puan Olmasaydı Hesaplan KV Tutarı"]
[null,null,null,{"$f":"F132","v":0},"5 Puan İndirimin Vergi Etkisi "]
[null,"32/7 Madde Kapsamında İndirimli Kurumlar Vergisi (Geçici Vergi) Oranı",{"$f":"IFERROR(D143/C141,0)","v":0},{"$f":"G132","v":0},"5 Puan İndirim Sonrasında Ödenecek KV Tutarı (İhracat)\n"]
[null,"32/8 Madde Kapsamında İndirimli Kurumlar Vergisine (Geçici Vergiye) Tabi Matrah  (Üretim)",{"$f":"D131","v":800000},{"$f":"E131","v":200000},"1 Puan Olmasaydı Hesaplan KV Tutarı"]
[null,null,null,{"$f":"F131","v":8000},"1 Puan İndirimin Vergi Etkisi "]
[null,"32/8 Madde Kapsamında İndirimli Kurumlar Vergisi (Geçici Vergi) Oranı",{"$f":"IFERROR(D146/C144,0)","v":0.24},{"$f":"G131","v":192000},"1 Puan İndirim Sonrasında Ödenecek KV Tutarı (Üretim)\n"]
[null,"Genel Orana Tabi Matrah (Diğer)",{"$f":"D130","v":200000},{"$f":"J130","v":50000},"Diğer Faalilyetlerden Elde Edilen Kazanç"]
[null,null,{"$f":"IFERROR(D147/C147,0)","v":0.25}]
[null,"MATRAHLAR TOPLAMI",{"$f":"C137+C144+C141+C147","v":1000000},{"$f":"D140+D146+D143+D147","v":242000}]

{"sheet":"32-1-2-10 Ö","index":16,"n_rows":149,"n_cols":14,"rows_kept":149,"cut":false,"hidden":true,"merged":[[84,2,84,6],[1,1,2,1],[59,1,59,2],[60,1,60,2],[71,1,72,1],[73,1,73,2],[74,1,74,2],[74,3,74,4],[75,1,75,2],[75,3,75,4],[79,1,79,3],[82,2,82,6],[85,2,85,6],[87,1,89,1],[87,2,88,2],[87,3,88,3],[87,4,88,4],[87,5,88,5],[135,1,135,4],[137,1,138,2],[104,13,107,13],[109,13,112,13],[114,13,117,13],[119,13,122,13],[124,13,127,13],[128,9,133,10],[129,13,132,13]]}
[]
[null,"FAALİYET TÜRLERİ İTİBARİYLE HASILATLAR VE TOPLAM İÇİNDEKİ ORANLARI",{"$f":"IFERROR(C4/C4,0)","v":1},{"$f":"IFERROR(D4/C4,0)","v":0},{"$f":"IFERROR(E4/C4,0)","v":0.7},{"$f":"IFERROR(F4/C4,0)","v":0.3}]
[null,null,"Toplam Hasılat","İhracat faaliyeti","İmalat faaliyeti","Diğer faaliyetler"]
[null,"A-BRÜT SATIŞLAR (60)",{"$f":"D4+E4+F4","v":2000000},{"$f":"SUM(D5:D7)","v":0},{"$f":"SUM(E5:E7)","v":1400000},600000]
[null,"1-Yurtiçi Satışlar (600)",{"$f":"D5+E5+F5","v":2000000},null,1400000,600000]
[null,"2-Yurtdışı Satışlar (601)",{"$f":"D6+E6+F6","v":0}]
[null,"3-Diğer Gelirler (602)",{"$f":"D7+E7+F7","v":0}]
[null,"B-SATIŞ İNDİRİMLERİ(-) (61)",{"$f":"SUM(C9:C11)","v":0},{"$f":"SUM(D9:D11)","v":0},{"$f":"SUM(E9:E11)","v":0},0]
[null,"1-Satıştan İadeler (-) (610)",{"$f":"SUM(D9:F9)","v":0}]
[null,"2- Satış İskontoları (-) (611)",{"$f":"SUM(D10:F10)","v":0}]
[null,"3-Diğer İndirimler (-) (612)",0]
[null,"C-NET SATIŞLAR",{"$f":"C4-C8","v":2000000},{"$f":"D4-D8","v":0},{"$f":"E4-E8","v":1400000},600000]
[null,"D-SATIŞLARIN MALİYETİ (-) (62)",{"$f":"SUM(C14:C17)","v":0},{"$f":"SUM(D14:D17)","v":0},{"$f":"SUM(E14:E17)","v":0},{"$f":"SUM(F14:F17)","v":0}]
[null,"1-Satılan Mamuller Maliyeti ( 620)",{"$f":"SUM(D14:F14)","v":0}]
[null,"2-Satılan Ticari Mal Maliyeti (621)",{"$f":"SUM(D15:F15)","v":0}]
[null,"3-Satılan Hizmet Maliyeti (622)",0]
[null,"4-Diğer Satışların Maliyeti (623)",0]
[null,"BRÜT SATIŞ KARI / ZARARI",{"$f":"C12-C13","v":2000000},{"$f":"D12-D13","v":0},{"$f":"E12-E13","v":1400000},600000]
[null,"E-FAALİYET GİDERLERİ (-) (63)",{"$f":"SUM(C20:C24)","v":0},{"$f":"SUM(D20:D24)","v":0},{"$f":"SUM(E20:E24)","v":0},0]
[null,"1-Araştırma ve Geliştirme Giderleri(-) (630)",{"$f":"SUM(D20:F20)","v":0}]
[null,"2-Pazarlama, Satış ve Dağıtım Giderleri(-) (631)",{"$f":"SUM(D21:F21)","v":0}]
[null,"3-Genel Yönetim Giderleri(-) (632)",{"$f":"SUM(D22:F22)","v":0}]
[null,"MÜŞTEREK GENEL GİDERLER (DAĞITIM-HASILAT PAYINA GÖRE)",null,{"$f":"C23*D2","v":0},{"$f":"C23*E2","v":0},{"$f":"C23*F2","v":0}]
[null,"MÜŞTEREK GENEL GİDER GİBİ DAĞITIMA TABİ TUTULACAK AMORTİSMAN GİDERLERİ  (DAĞITIM-HASILAT PAYINA GÖRE)",null,{"$f":"C24*D2","v":0},{"$f":"C24*E2","v":0},{"$f":"C24*F2","v":0}]
[null,"FAALİYET KARI / ZARARI ",{"$f":"C18-C19","v":2000000},{"$f":"D18-D19","v":0},{"$f":"E18-E19","v":1400000},600000]
[null,"F-DİĞER FAALİYETLERDEN OLAĞAN GELİR VE KARLAR (64)",{"$f":"SUM(C27:C35)","v":0},{"$f":"SUM(D27:D35)","v":0},{"$f":"SUM(E27:E35)","v":0},{"$f":"SUM(F27:F35)","v":0}]
[null,"         1- İŞTİRAKLERDEN TEMETTÜ GELİRLERİ (640)",{"$f":"SUM(D27:F27)","v":0}]
[null,"         2- BAĞLI ORTAKLIKLARDAN TEMETTÜ GELİRLERİ (641)",{"$f":"SUM(D28:F28)","v":0}]
[null,"         3- FAİZ GELİRLERİ (642) (ihracat ve imalat kaynaklı alacağın tahsiline kadar olan süreçte oluşan)",0]
[null,"         4- KOMİSYON GELİRLERİ (643)",0]
[null,"         5- KONUSU OLMAYAN KARŞILIKLAR (644)",0]
[null,"         6- MENKUL KIYMET SATIŞ KARLARI (645)",0]
[null,"         7- KAMBİYO KARLARI (646) (ihracat ve imalat kaynaklı alacağın tahsiline kadar olan süreçte oluşan)",0]
[null,"         8- REESKONT FAİZ GELİRLERİ (647)",0]
[null,"         9- FAALİYETLE İLGİLİ DİĞER GELİR VE KARLAR (649)",0]
[null,"ARA TOPLAM",{"$f":"C25+C26","v":2000000},{"$f":"D25+D26","v":0},{"$f":"E25+E26","v":1400000},{"$f":"F25+F26","v":600000}]
[null,"G-DİĞER FAALİYETLERDEN OLAĞAN GİDER VE ZARARLAR(-) (65)",{"$f":"SUM(C38:C43)","v":0},{"$f":"SUM(D38:D43)","v":0},{"$f":"SUM(E38:E43)","v":0},0]
[null,"         1- KOMİSYON GİDERLERİ (653)",{"$f":"SUM(D38:F38)","v":0}]
[null,"         2- KARŞILIK GİDERLERİ (654)",{"$f":"SUM(D39:F39)","v":0}]
[null,"         3- MENKUL KIYMET SATIŞ ZARARLARI (655)",0]
[null,"         4- KAMBİYO ZARARLARI (656) (ihracat ve imalat kaynaklı alacağın tahsiline kadar olan süreçte oluşan)",0]
[null,"         5- REESKONT FAİZ GİDERLERİ (657)",0]
[null,"         6- DİĞER OLAĞAN GİDER VE ZARARLAR (659)",{"$f":"SUM(D43:F43)","v":0}]
[null,"ARA TOPLAM",{"$f":"C36-C37","v":2000000},{"$f":"D36-D37","v":0},{"$f":"E36-E37","v":1400000},600000]
[null,"H-FİNANSMAN GİDERLERİ(-) (66)",{"$f":"SUM(C46:C49)","v":0},{"$f":"SUM(D46:D49)","v":0},{"$f":"SUM(E46:E49)","v":0},{"$f":"SUM(F46:F49)","v":0}]
[null,"         1- KISA VADELİ BORÇLANMA GİDERLERİ (-)",{"$f":"SUM(D46:F46)","v":0}]
[null,"         2- UZUN VADELİ BORÇLANMA GİDERLERİ (-)",{"$f":"SUM(D47:F47)","v":0}]
[null,"         1- KISA VADELİ BORÇLANMA GİDERLERİ (-) (DAĞITIM)",null,{"$f":"C48*D2","v":0},{"$f":"C48*E2","v":0},{"$f":"C48*F2","v":0}]
[null,"         2- UZUN VADELİ BORÇLANMA GİDERLERİ (-) (DAĞITIM)",null,{"$f":"C49*D2","v":0},{"$f":"C49*E2","v":0},{"$f":"C49*F2","v":0}]
[null,"ARA TOPLAM",{"$f":"C44-C45","v":2000000},{"$f":"D44-D45","v":0},{"$f":"E44-E45","v":1400000},{"$f":"F44-F45","v":600000}]
[null,"I-OLAĞANDIŞI GELİR VE KÂRLAR (67)",{"$f":"SUM(D51:F51)","v":0},{"$f":"SUM(D52:D53)","v":0},{"$f":"SUM(E52:E53)","v":0},{"$f":"SUM(F52:F53)","v":0}]
[null,"1- ÖNCEKİ DÖNEM GELİR VE KARLARI (671)",{"$f":"SUM(D52:F52)","v":0}]
[null,"2-DİĞER OLAĞAN DIŞI GELİR VE KARLAR (679)",{"$f":"SUM(D53:F53)","v":0}]
[null,"ARA TOPLAM",{"$f":"SUM(D54:F54)","v":2000000},{"$f":"D50+D51","v":0},{"$f":"E50+E51","v":1400000},600000]
[null,"J-OLAĞANDIŞI GİDER VE ZARARLAR(-) (68)",{"$f":"SUM(C56:C58)","v":0},{"$f":"SUM(D56:D58)","v":0},{"$f":"SUM(E56:E58)","v":0},0]
[null,"1-Çalışmayan Kısım Gider ve Zararları(-) (680)",{"$f":"SUM(D56:F56)","v":0}]
[null,"2-Önceki Dönem Gider ve Zararları(-) (681)",{"$f":"SUM(D57:F57)","v":0}]
[null,"3-Diğer Olağan Dışı Gider ve Zararlar(-) (689)",{"$f":"SUM(D58:F58)","v":0}]
[null,"DÖNEM KÂRI VEYA ZARARI \n(TİCARİ BİLANÇO KARI ZARARI )",{"$f":"C54-C55","v":2000000},{"$f":"D54-D55","v":0},{"$f":"E54-E55","v":1400000},600000]
[null,"İHRACAT, İMALAT VE DİĞER FAALİYETLERDEN ELDE EDİLEN KAZANCIN TOPLAM TİCARİ KAZANÇ İÇİNDEKİ PAYLARI  \n\n(Kazançlar arasında Öncelik İhracat Kazancına Verilmiştir. İhrcat Kazancından arta kalan Ticari Kazanç İmalat ve Diğer Faaliyetlere Sayılmıştır.)\n\n",null,{"$f":"IF(D59>=$C$59,1,\n    IF(D59<=0,0,\n    IF(AND(D59>0,D59<$C$59),D59/$C$59)))","v":0},{"$f":"IF(E59>=$C$59,1,\n    IF(E59<=0,0,\n    IF(AND(E59>0,E59<$C$59),E59/$C$59)))","v":0.7},{"$f":"IF(F59>=$C$59,1,\n    IF(F59<=0,0,\n    IF(AND(F59>0,F59<$C$59),F59/$C$59)))","v":0.3}]
[null,null,null,{"$f":"D60/(D60+E60+F60)","v":0},{"$f":"E60/(D60+E60+F60)","v":0.7},{"$f":"F60/(D60+E60+F60)","v":0.3}]
[]
[null,"KKEG +",500000]
[null," KABUL EDİLMEYEN GELİRLER -"]
[null,"ZARAR OLSA DAHİ İNDİRİLECEK İSTİSNALAR -",{"$f":"C66+C67+C68","v":0}]
[null,"Hizmet İhracatı Faaliyetinden (KVK 10-1/ğ) Elde Edilen Kazançlardan İstisna Edilenlerin Toplamı"]
[null,"İmalat Faaliyetinden Elde Edilen Kazançlardan İstisna Edilenlerin Toplamı"]
[null,"Diğer Faaliyetlerden Elde Edilen Kazançlardan İstisna Edilenlerin Toplamı"]
[null,"GEÇMİŞ YIL ZARARLARI -",2000000]
[null,"İNDİRİMLER -",null,"AZAMİ YAZILABİLECEK İNDİRİMLER TUTARI",{"$f":"C59+C63-C64-C65-C69","v":500000}]
[]
[null,"1 PUAN İNDİRİM UYGULANACAK TUTARIN HESABINDA İSTİSNA KAZANÇLAR DÜŞÜLDÜKTEN SONRA BULUNAN TİCARİ KAZANÇ TUTARI İLE  İHRACAT,İMALAT VE DİĞER KAZANÇLARIN TUTARI","TİCARİ KAZANÇ TAN İhracat ve İmalat Kazancından İstisna Olan Tutarlar Düşüldükten Sonra Kalan Tutarı","İhracat Faaliyetinden Elde Edilen  Kazançtan İstisna Olan Kısım Düşüldükten Sonra Bulunan Tutarı","Üretim  Faaliyetinden Elde Edilen  Kazançtan İstisna Olan Kısım Düşüldükten Sonra Bulunan Tutarı","Diğer Faaliyetinden Elde Edilen  Kazanç"]
[null,null,{"$f":"IF(C59-C66-C67<=0,0,C59-C66-C67)","v":2000000},{"$f":"IF($D$59-C66<=0,0,MIN($D$59-C66,$C$73*D61))","v":0},{"$f":"IF($E$59-C67<=0,0,MIN($E$59-C67,$C$73*E61))","v":1400000},{"$f":"IF(C73-D73-E73<=0,0,C73-D73-E73)","v":600000}]
[null,"MATRAH DAĞITIM PAYLARI",null,{"$f":"IFERROR(IF(D73/C73<=0,0,D73/C73),0)","v":0},{"$f":"IFERROR(IF(E73/C73<=0,0,E73/C73),0)","v":0.7},{"$f":"IFERROR(F73/C73,0)","v":0.3}]
[null,"İHRACAT, İMALAT VE DİĞER FAALİYETLERDEN ELDE EDİLEN KAZANCIN TOPLAM TİCARİ KAZANÇ İÇİNDEKİ PAYLARI ",null,{"$f":"IFERROR(IF(AND(D73+E73>C73, F73<=0),1,(D73+E73)/C73),0)","v":0.7},null,{"$f":"IFERROR(IF(F73<=0,0,F73/C73),0)","v":0.3}]
[null,"NEGATİF VE % 100 DEN BÜYÜKLÜK KONTROLÜ SONRASINDAKİ PAYLARI",null,{"$f":"IFERROR(IF(D75<=0,0,IF(D75>1,1,D75)),0)","v":0.7},null,{"$f":"IFERROR(IF(F75<=0,0,IF(F75>1,1,F75)),0)","v":0.3}]
[]
[null,"SAFİ KURUM KAZANCI \n(KURUMLAR VERGİSİ MATRAHI)",{"$f":"C59+C63-C64-C65-C69-C70","v":500000},{"$f":"IF(C78<0, \"ZARAR\",\"KAR\")","v":"KAR"}]
[]
[null,"2022 YILI 3. DÖNEM İNDİRİMLİ KURUMLAR VERGİSİ HESAPLAMA TABLOSU"]
[null,null,"1. TEŞVİK BELGESİ","2. TEŞVİK BELGESİ","3. TEŞVİK BELGESİ","4. TEŞVİK BELGESİ","5. TEŞVİK BELGESİ"]
[null,"Vergi İndirim Oranı (VİO)"]
[null,"KV MATRAHI (Safi Kurum Kazancı)",{"$f":"C78","v":500000}]
[null,"32/A  Uygulanacak K.V. Matrahı (HER BİR TEŞVİK BELGESİ KAPSAMINDA YARARLANILABİLECEK YATIRIMA KATKI TUTARININ MATRAHI BU HÜCRELERE YAZILMALIDIR)",null,null,null,null,null,{"$f":"IF(SUM(C84:G84)>C78,\"32/A İNDİRİMİ UYGULANACAK KAZANÇ, SAFİ KURUM KAZANCINDAN FAZLADIR\",SUM(C84:G84))","v":0}]
[null,"32/A UYGULANMAYACAK K.V.  Matrahı",{"$f":"IF(C83-(C84+D84+E84+F84+G84)<0,0,C83-(C84+D84+E84+F84+G84))","v":500000}]
[null,"MATRAH TOPLAMI",{"$f":"IF((C84+D84+E84+F84+G84+C85)>C78,C78,(C84+D84+E84+F84+G84+C85))","v":500000}]
[]
[null,"SAFİ KURUM KAZANCININ  KV VERGİ ORANLARI İTİBARİYLE DAĞILIMI ","TOPLAM SAFİ KAZANÇ","İhracat Kazancı Payı","Üretim Kazancı Payı","Diğer Faaliyet Kazancı Payı"]
[]
[null,null,{"$f":"C78","v":500000},{"$f":"IF(AND(AND($D$59>0,($D$59+$E$59)>=$C$59,D59>=C66),$C$90>=MAX(D59,D73)),\n\nMIN(MAX(IF(D59<=C90,D59,IF(D73<=C90,D73)),$C$90*D74)),\n\nIF(OR(D59<=0,D73<=0),0,\n\nMIN( MAX(   MAX(   IF(D59<=C90,D59),  IF(D73<=C90,D73) ),    MIN($C$90*D74,D59,D73)),$C$90)))","v":0},{"$f":"MIN( IF(AND(AND($E$59>0,($D$59+$E$59)>=$C$59,E59>=C67),$C$90>=MAX(E59,E73)),\n\nMIN(MAX(IF(E59<=C90,E59,IF(E73<=C90,E73)),$C$90*E74)),\n\nIF(OR(E59<=0,E73<=0),0,\n\nMIN( MAX(   MAX(   IF(E59<=C90,E59),  IF(E73<=C90,E73) ),    MIN($C$90*E74,E59,E73)),$C$90))),C90-D90)","v":350000},{"$f":"C90-D90-E90","v":150000}]
[null,"SAFİ KURUM KAZANCININ DAĞILIMI ORANSAL DAĞILIMI",{"$f":"C90","v":500000},{"$f":"D90/C90","v":0},{"$f":"E90/C90","v":0.7},{"$f":"F90/C90","v":0.3}]
[null,"SAFİ KURUM KAZANCININ DAĞILIMI TUTARSAL",{"$f":"C91","v":500000},{"$f":"D90","v":0},{"$f":"E90","v":350000},{"$f":"F90","v":150000}]
[null,"SAFİ KURUM KAZANCI DAĞILIMI",{"$f":"C92","v":500000},{"$f":"IFERROR(IF(D92/C92>=1,1,D92/C92),0)","v":0},{"$f":"IFERROR(IF(E92/C92>=1,1,E92/C92),0)","v":0.7},{"$f":"IFERROR(IF(F92/C92>=1,1,F92/C92),0)","v":0.3},null,"KV ORANI","KV ORANI"]
[null,"1 PUAN VE 32/A İNDİRİMİ OLMASAYDI HESAPLANAN KV TUTARI",{"$f":"C93*$H$94","v":125000},{"$f":"D92*$H$94","v":0},{"$f":"E92*$H$94","v":87500},{"$f":"F92*$H$94","v":37500},null,0.25,0.25]
[null,"32/ A UYGULANAN MATRAH",{"$f":"C84+D84+E84+F84+G84","v":0},{"$f":"D107+D112+D117+D122+D127","v":0},{"$f":"D106+D111+D116+D121+D126","v":0},{"$f":"D105+D110+D115+D120+D125","v":0}]
[null,"32/A UYGULANACAK MATRAH ÜZERİNDEN ÖDENECEK KV TUTARI",{"$f":"J108+J113+J118+J123+J128","v":0},{"$f":"J107+J112+J117+J122+J127","v":0},{"$f":"J106+J111+J116+J121+J126","v":0},{"$f":"J105+J110+J115+J120+J125","v":0}]
[null,"32/A UYGULANMAYAN MATRAH",{"$f":"IF(C85<=0,0,C85)","v":500000},{"$f":"D132","v":0},{"$f":"D131","v":350000},{"$f":"D130","v":150000}]
[null,"32/A UYGULANMAYAN MATRAH ÜZERİNDEN ÖDENECEK KV TUTARI",{"$f":"L130","v":34500},{"$f":"J132","v":0},{"$f":"J131","v":0},{"$f":"J130","v":0}]
[null,"TOPLAM ÖDENECEK KV",{"$f":"C96+C98","v":34500},{"$f":"J132+J107","v":0},{"$f":"J131+J106","v":0},{"$f":"J130+J105","v":0}]
[null,"TOPLAM AVANTAJ  (YARARLANILAN 1 PUAN İNDİRİMİ + 32/A İNDİRİMİ TUTARI )",{"$f":"C94-C99","v":90500},{"$f":"D101+D102","v":0.72},{"$f":"E101+E102","v":7001.1},{"$f":"F101+F102","v":3001.15}]
[null,"YARARLANILAN 1 - 5 PUAN İNDİRİMİ TUTARI",{"$f":"F133+F128+F123+F118+F113+F108","v":10000},{"$f":"F132+F107+F112+F117+F122+F127","v":0},{"$f":"F131+F106+F111+F116+F121+F126","v":7000},{"$f":"F130+F105+F110+F115+F120+F125","v":3000}]
[null,"YARLANILAN 32/A İNDİRİMİ TUTARI",{"$f":"K108+K113+K118+K123+K128+K133","v":0},{"$f":"K107+K112+K122+K127+K132","v":0.72},{"$f":"K106+K111+K116+K121+K126+K131","v":1.1000000000000001},{"$f":"K105++K110+K115+K120+K125+K130","v":1.1500000000000001}]
[]
[null,"32/A UYGULANABİLECEK MATRAH (1.TEŞVİK BELGESİ)",{"$f":"C84","v":0},"KV MATRAHI","32/6 VE 1 - 5 PUAN İNDİRİM OLMASAYDI HESAPLANAN KV TUTARI","32/6 NEDENİYLE HESAPLANAN İNDİRİM TUTAR","32/6 A İNDİRİMİ SONRASINDA HESAPLANAN KURUMLAR VERGİSİ TUTARI","1 - 5 Puan İndirim Tutarı","1 -5 Puan İndirim Sonrasında Hesaplanan KV Tutarı","32/A İndirimi Olmasaydı Ödenecek KV Tutarı","32/6 İndirimi  / 1 -5 Puan İndirim ve 32/A VİO Uygulandıktan Sonra Tatbik Edilecek KV Oranı","1 - 5 Puan İndirim ve 32/A İndirimi Uygulandıktan Sonra Ödenecek  KV Tutarı","Yararlanılan Yatırıma Katkı Tutarı\n(32/A İnd. KV Nedeniyle Vazgeçilen Vergi Tutarı)","Ödenecek KV Tutarı"]
[null,"GENEL ORANA TABİ KISIM (DİĞER FAALİYETLER)",{"$f":"F93","v":0.3},{"$f":"C104*C105","v":0},{"$f":"D105*$I$94","v":0},{"$f":"D105*0.02","v":0},{"$f":"E105-F105","v":0},0,{"$f":"E105-H105-F105","v":0},{"$f":"I105","v":0},{"$f":"($I$94-0.02)-(($I$94-0.02)*C82)","v":0.23},{"$f":"K105*D105","v":0},{"$f":"J105-L105","v":0},{"$f":"L108","v":0}]
[null,"1 PUAN İNDİRİMLİ ORANA TABİ KISIM  (İMALAT)",{"$f":"E93","v":0.7},{"$f":"C104*C106","v":0},{"$f":"D106*$I$94","v":0},{"$f":"D106*0.02","v":0},{"$f":"E106-F106","v":0},{"$f":"D106/100","v":0},{"$f":"E106-H106-F106","v":0},{"$f":"I106","v":0},{"$f":"($I$94-0.03)-(($I$94-0.03)*C82)","v":0.22},{"$f":"K106*D106","v":0},{"$f":"J106-L106","v":0}]
[null,"5 PUAN İNDİRİMLİ ORANA TABİ KISIM  ( İHRACAT)",{"$f":"D93","v":0},{"$f":"C104*C107","v":0},{"$f":"D107*$I$94","v":0},0,0,{"$f":"D107/20","v":0},{"$f":"E107-H107-F107","v":0},0,{"$f":"($I$94-0.07)-(($I$94-0.07)*C82)","v":0.18},{"$f":"K107*D107","v":0},0]
[null,"TOPLAM",{"$f":"SUM(C105:C107)","v":1},{"$f":"SUM(D105:D107)","v":0},0,0,0,{"$f":"SUM(H105:H107)","v":0},{"$f":"SUM(I105:I107)","v":0},{"$f":"SUM(J105:J107)","v":0},null,0,0]
[null,"32/A UYGULANABİLECEK MATRAH (2.TEŞVİK BELGESİ)",{"$f":"D84","v":0},"KV MATRAHI","32/6 VE 1-5 PUAN İNDİRİM OLMASAYDI HESAPLANAN KV TUTARI","32/6 NEDENİYLE HESAPLANAN İNDİRİM TUTAR","32/6 A İNDİRİMİ SONRASINDA HESAPLANAN KURUMLAR VERGİSİ TUTARI","1 - 5 Puan İndirim Tutarı","1 -5 Puan İndirim Sonrasında Hesaplanan KV Tutarı","32/A İndirimi Olmasaydı Ödenecek KV Tutarı","32/6 İndirimi  / 1 - 5 Puan İndirim ve 32/A VİO Uygulandıktan Sonra Tatbik Edilecek KV Oranı","1 -5 Puan İndirim ve 32/A İndirimi Uygulandıktan Sonra Ödenecek  KV Tutarı","Yararlanılan Yatırıma Katkı Tutarı\n(32/A İnd. KV Nedeniyle Vazgeçilen Vergi Tutarı)","Ödenecek KV Tutarı"]
[null,"GENEL ORANA TABİ KISIM (DİĞER FAALİYETLER)",{"$f":"F93","v":0.3},{"$f":"C109*C110","v":0},{"$f":"D110*$I$94","v":0},{"$f":"D110*0.02","v":0},{"$f":"E110-F110","v":0},0,{"$f":"E110-H110-F110","v":0},{"$f":"I110","v":0},{"$f":"($I$94-0.02)-(($I$94-0.02)*D82)","v":0.23},{"$f":"K110*D110","v":0},{"$f":"J110-L110","v":0},{"$f":"L113","v":0}]
[null,"1 PUAN İNDİRİMLİ ORANA TABİ KISIM  (İMALAT)",{"$f":"E93","v":0.7},{"$f":"C109*C111","v":0},{"$f":"D111*$I$94","v":0},{"$f":"D111*0.02","v":0},{"$f":"E111-F111","v":0},{"$f":"D111/100","v":0},{"$f":"E111-H111-F111","v":0},{"$f":"I111","v":0},{"$f":"($I$94-0.03)-(($I$94-0.03)*D82)","v":0.22},{"$f":"K111*D111","v":0},{"$f":"J111-L111","v":0}]
[null,"5 PUAN İNDİRİMLİ ORANA TABİ KISIM  ( İHRACAT)",{"$f":"D93","v":0},{"$f":"C109*C112","v":0},{"$f":"D112*$I$94","v":0},0,0,{"$f":"D112/20","v":0},{"$f":"E112-H112-F112","v":0},0,{"$f":"($I$94-0.07)-(($I$94-0.07)*D82)","v":0.18},{"$f":"K112*D112","v":0},0]
[null,"TOPLAM",{"$f":"SUM(C110:C112)","v":1},0,0,0,0,{"$f":"SUM(H110:H112)","v":0},{"$f":"SUM(I110:I112)","v":0},{"$f":"SUM(J110:J112)","v":0},null,{"$f":"SUM(L110:L112)","v":0},0]
[null,"32/A UYGULANABİLECEK MATRAH (3.TEŞVİK BELGESİ)",{"$f":"E84","v":0},"KV MATRAHI","32/6 VE 1 - 5 PUAN İNDİRİM OLMASAYDI HESAPLANAN KV TUTARI","32/6 NEDENİYLE HESAPLANAN İNDİRİM TUTAR","32/6 A İNDİRİMİ SONRASINDA HESAPLANAN KURUMLAR VERGİSİ TUTARI","1 - 5 Puan İndirim Tutarı","1 -5 Puan İndirim Sonrasında Hesaplanan KV Tutarı","32/A İndirimi Olmasaydı Ödenecek KV Tutarı","32/6 İndirimi  / 1 -5 Puan İndirim ve 32/A VİO Uygulandıktan Sonra Tatbik Edilecek KV Oranı","1 - 5 Puan İndirim ve 32/A İndirimi Uygulandıktan Sonra Ödenecek  KV Tutarı","Yararlanılan Yatırıma Katkı Tutarı\n(32/A İnd. KV Nedeniyle Vazgeçilen Vergi Tutarı)","Ödenecek KV Tutarı"]
[null,"GENEL ORANA TABİ KISIM (DİĞER FAALİYETLER)",{"$f":"F93","v":0.3},{"$f":"C114*C115","v":0},{"$f":"D115*$I$94","v":0},{"$f":"D115*0.02","v":0},{"$f":"E115-F115","v":0},0,{"$f":"E115-H115-F115","v":0},{"$f":"I115","v":0},{"$f":"($I$94-0.02)-(($I$94-0.02)*E82)","v":0.23},{"$f":"K115*D115","v":0},{"$f":"J115-L115","v":0},{"$f":"L118","v":0}]
[null,"1 PUAN İNDİRİMLİ ORANA TABİ KISIM  (İMALAT)",{"$f":"E93","v":0.7},{"$f":"C114*C116","v":0},{"$f":"D116*$I$94","v":0},{"$f":"D116*0.02","v":0},{"$f":"E116-F116","v":0},{"$f":"D116/100","v":0},{"$f":"E116-H116-F116","v":0},{"$f":"I116","v":0},{"$f":"($I$94-0.03)-(($I$94-0.03)*E82)","v":0.22},{"$f":"K116*D116","v":0},{"$f":"J116-L116","v":0}]
[null,"5 PUAN İNDİRİMLİ ORANA TABİ KISIM  ( İHRACAT)",{"$f":"D93","v":0},{"$f":"C114*C117","v":0},{"$f":"D117*$I$94","v":0},0,0,{"$f":"D117/20","v":0},{"$f":"E117-H117-F117","v":0},0,{"$f":"($I$94-0.07)-(($I$94-0.07)*E82)","v":0.18},{"$f":"K117*D117","v":0},0]
[null,"TOPLAM",{"$f":"SUM(C115:C117)","v":1},0,0,0,0,{"$f":"SUM(H115:H117)","v":0},{"$f":"SUM(I115:I117)","v":0},{"$f":"SUM(J115:J117)","v":0},null,{"$f":"SUM(L115:L117)","v":0},0]
[null,"32/A UYGULANABİLECEK MATRAH (4. TEŞVİK BELGESİ)",{"$f":"F84","v":0},"KV MATRAHI","32/6 VE 1-5 PUAN İNDİRİM OLMASAYDI HESAPLANAN KV TUTARI","32/6 NEDENİYLE HESAPLANAN İNDİRİM TUTAR","32/6 A İNDİRİMİ SONRASINDA HESAPLANAN KURUMLAR VERGİSİ TUTARI","1 - 5 Puan İndirim Tutarı","1 -5 Puan İndirim Sonrasında Hesaplanan KV Tutarı","32/A İndirimi Olmasaydı Ödenecek KV Tutarı","32/6 İndirimi  / 1 - 5 Puan İndirim ve 32/A VİO Uygulandıktan Sonra Tatbik Edilecek KV Oranı","1 -5 Puan İndirim ve 32/A İndirimi Uygulandıktan Sonra Ödenecek  KV Tutarı","Yararlanılan Yatırıma Katkı Tutarı\n(32/A İnd. KV Nedeniyle Vazgeçilen Vergi Tutarı)","Ödenecek KV Tutarı"]
[null,"GENEL ORANA TABİ KISIM (DİĞER FAALİYETLER)",{"$f":"F93","v":0.3},{"$f":"C119*C120","v":0},{"$f":"D120*$I$94","v":0},{"$f":"D120*0.02","v":0},{"$f":"E120-F120","v":0},0,{"$f":"E120-H120-F120","v":0},{"$f":"I120","v":0},{"$f":"($I$94-0.02)-(($I$94-0.02)*F82)","v":0.23},{"$f":"K120*D120","v":0},{"$f":"J120-L120","v":0},{"$f":"L123","v":0}]
[null,"1 PUAN İNDİRİMLİ ORANA TABİ KISIM  (İMALAT)",{"$f":"E93","v":0.7},{"$f":"C119*C121","v":0},{"$f":"D121*$I$94","v":0},{"$f":"D121*0.02","v":0},{"$f":"E121-F121","v":0},{"$f":"D121/100","v":0},{"$f":"E121-H121-F121","v":0},{"$f":"I121","v":0},{"$f":"($I$94-0.03)-(($I$94-0.03)*F82)","v":0.22},{"$f":"K121*D121","v":0},{"$f":"J121-L121","v":0}]
[null,"5 PUAN İNDİRİMLİ ORANA TABİ KISIM  ( İHRACAT)",{"$f":"D93","v":0},{"$f":"C119*C122","v":0},{"$f":"D122*$I$94","v":0},0,0,{"$f":"D122/20","v":0},{"$f":"E122-H122-F122","v":0},0,{"$f":"($I$94-0.07)-(($I$94-0.07)*F82)","v":0.18},{"$f":"K122*D122","v":0},0]
[null,"TOPLAM",{"$f":"SUM(C120:C122)","v":1},0,0,0,0,{"$f":"SUM(H120:H122)","v":0},{"$f":"SUM(I120:I122)","v":0},{"$f":"SUM(J120:J122)","v":0},null,{"$f":"SUM(L120:L122)","v":0},0]
[null,"32/A UYGULANABİLECEK MATRAH (5.TEŞVİK BELGESİ)",{"$f":"G84","v":0},"KV MATRAHI","32/6 VE 1 - 5 PUAN İNDİRİM OLMASAYDI HESAPLANAN KV TUTARI","32/6 NEDENİYLE HESAPLANAN İNDİRİM TUTAR","32/6 A İNDİRİMİ SONRASINDA HESAPLANAN KURUMLAR VERGİSİ TUTARI","1 - 5 Puan İndirim Tutarı","1 -5 Puan İndirim Sonrasında Hesaplanan KV Tutarı","32/A İndirimi Olmasaydı Ödenecek KV Tutarı","32/6 İndirimi  / 1 -5 Puan İndirim ve 32/A VİO Uygulandıktan Sonra Tatbik Edilecek KV Oranı","1 - 5 Puan İndirim ve 32/A İndirimi Uygulandıktan Sonra Ödenecek  KV Tutarı","Yararlanılan Yatırıma Katkı Tutarı\n(32/A İnd. KV Nedeniyle Vazgeçilen Vergi Tutarı)","Ödenecek KV Tutarı"]
[null,"GENEL ORANA TABİ KISIM (DİĞER FAALİYETLER)",{"$f":"F93","v":0.3},{"$f":"C124*C125","v":0},{"$f":"D125*$I$94","v":0},{"$f":"D125*0.02","v":0},{"$f":"E125-F125","v":0},0,{"$f":"E125-H125-F125","v":0},{"$f":"I125","v":0},{"$f":"($I$94-0.02)-(($I$94-0.02)*F82)","v":0.23},{"$f":"K125*D125","v":0},{"$f":"J125-L125","v":0},{"$f":"L128","v":0}]
[null,"1 PUAN İNDİRİMLİ ORANA TABİ KISIM  (İMALAT)",{"$f":"E93","v":0.7},{"$f":"C124*C126","v":0},{"$f":"D126*$I$94","v":0},{"$f":"D126*0.02","v":0},{"$f":"E126-F126","v":0},{"$f":"D126/100","v":0},{"$f":"E126-H126-F126","v":0},{"$f":"I126","v":0},{"$f":"($I$94-0.03)-(($I$94-0.03)*G82)","v":0.22},{"$f":"K126*D126","v":0},{"$f":"J126-L126","v":0}]
[null,"5 PUAN İNDİRİMLİ ORANA TABİ KISIM  ( İHRACAT)",{"$f":"D93","v":0},{"$f":"C124*C127","v":0},{"$f":"D127*$I$94","v":0},0,0,{"$f":"D127/20","v":0},{"$f":"E127-H127-F127","v":0},0,{"$f":"($I$94-0.07)-(($I$94-0.07)*G82)","v":0.18},{"$f":"K127*D127","v":0},0]
[null,"TOPLAM",{"$f":"SUM(C125:C127)","v":1},0,0,0,0,{"$f":"SUM(H125:H127)","v":0},{"$f":"SUM(I125:I127)","v":0},{"$f":"SUM(J125:J127)","v":0},null,{"$f":"SUM(L125:L127)","v":0},0]
[null,"32/A UYGULANAMAYACAK MATRAH",{"$f":"IF(C85<=0,0,C85)","v":500000},"KV MATRAHI","32/6 VE 1-5 PUAN İNDİRİM OLMASAYDI HESAPLANAN KV TUTARI","32/6 NEDENİYLE HESAPLANAN İNDİRİM TUTAR","32/6 A İNDİRİMİ SONRASINDA HESAPLANAN KURUMLAR VERGİSİ TUTARI","1 - 5 Puan İndirim Tutarı","1 -5 Puan İndirim Sonrasında Hesaplanan KV Tutarı","32/A İNDİRİMİ UYGULANMAZ",null,"1 Puan İndirim ve 32/A İndirimi Uygulandıktan Sonra Ödenecek  KV Tutarı","Yararlanılan Yatırıma Katkı Tutarı\n(32/A İnd. KV Nedeniyle Vazgeçilen Vergi Tutarı)","Ödenecek KV Tutarı"]
[null,"GENEL ORANA TABİ KISIM (DİĞER FAALİYETLER)",{"$f":"F93","v":0.3},{"$f":"C129*C130","v":150000},{"$f":"D130*$I$94","v":37500},{"$f":"D130*0.02","v":3000},{"$f":"E130-F130","v":34500},0,{"$f":"E130-H130-F130","v":34500},null,null,{"$f":"I130","v":34500},0,{"$f":"L133","v":111500}]
[null,"1 PUAN İNDİRİMLİ ORANA TABİ KISIM  (İMALAT)",{"$f":"E93","v":0.7},{"$f":"C131*C129","v":350000},{"$f":"D131*$I$94","v":87500},{"$f":"D131*0.02","v":7000},{"$f":"E131-F131","v":80500},{"$f":"D131/100","v":3500},{"$f":"E131-H131-F131","v":77000},null,null,{"$f":"I131","v":77000},0]
[null,"5 PUAN İNDİRİMLİ ORANA TABİ KISIM  ( İHRACAT)",{"$f":"D93","v":0},{"$f":"C132*C129","v":0},{"$f":"D132*$I$94","v":0},0,0,{"$f":"D132/20","v":0},{"$f":"E132-H132-F132","v":0},null,null,0,0]
[null,"TOPLAM",{"$f":"SUM(C130:C132)","v":1},{"$f":"SUM(D130:D132)","v":500000},125000,{"$f":"SUM(F130:F132)","v":10000},115000,{"$f":"SUM(H130:H132)","v":3500},{"$f":"SUM(I130:I132)","v":111500},null,null,111500,{"$f":"SUM(M130:M132)","v":0}]
[null,"TOPLAM KV MATRAHI VE ÖDENMESİ GEREKEN KV ",{"$f":"C104+C129+C109+C114+C119+C124","v":500000},{"$f":"D108+D133+D113+D118+D123+D128","v":500000},125000,10000,115000,3500,111500,null,null,{"$f":"L108+L133+L113+L118+L123+L128","v":111500},{"$f":"M133+M108+M113+M118+M123+M128","v":0},{"$f":"N105+N130+N110+N115+N120+N125","v":111500}]
[]
[null,"GEÇİCİ VERGİ BEYANNMESİNDE MATRAH BİLDİRİMİ BÖLÜMÜNDE DOLDURULACAK KISIMLAR VE TUTARLARI"]
[null,"32 A Madde Kapsamında İndirimli Kurumlar Vergisine (Geçici Vergiye) Tabi Matrah",{"$f":"C104+C109+C114+C119+C124","v":0},{"$f":"E108+E113+E118+E123+E128","v":0},"1-5 Puan Olmasaydı Hesaplan KV Tutarı"]
[null,null,null,{"$f":"I108+I113+I118+I123++I128","v":0}," 1 -5 Puan İndirim Sonrasında Ödenecek KV Tutarı\n (32 A olmasaydı hesaplanacak Vergi)"]
[null,null,null,{"$f":"M108+M113+M118+M123+M128","v":0},"32/A İndirimi ile Vazgeçilen Vergi"]
[null,"32 A Madde Kapsamında İndirimli Kurumlar Vergisi(Geçici Vergi) Oranı",{"$f":"IFERROR(D140/C137,0)","v":0},{"$f":"N105+N110+N115+N120+N125","v":0},"32/A ya Tabi Matrah Üzerinden Ödenecek KV"]
[null,"32/7 Madde Kapsamında İndirimli Kurumlar Vergisine (Geçici Vergiye) Tabi Matrah  (İhracat)",{"$f":"D132","v":0},{"$f":"G132","v":0},"5  Puan Olmasaydı Hesaplan KV Tutarı"]
[null,null,null,{"$f":"H132","v":0},"5 Puan İndirimin Vergi Etkisi "]
[null,"32/7 Madde Kapsamında İndirimli Kurumlar Vergisi (Geçici Vergi) Oranı",{"$f":"IFERROR(D143/C141,0)","v":0},{"$f":"I132","v":0},"5 Puan İndirim Sonrasında Ödenecek KV Tutarı (İhracat)\n"]
[null,"32/8 Madde Kapsamında İndirimli Kurumlar Vergisine (Geçici Vergiye) Tabi Matrah  (Üretim)",{"$f":"D131","v":350000},{"$f":"G131","v":80500},"1 Puan Olmasaydı Hesaplan KV Tutarı"]
[null,null,null,{"$f":"H131","v":3500},"1 Puan İndirimin Vergi Etkisi "]
[null,"32/8 Madde Kapsamında İndirimli Kurumlar Vergisi (Geçici Vergi) Oranı",{"$f":"IFERROR(D146/C144,0)","v":0.22},{"$f":"I131","v":77000},"1 Puan İndirim Sonrasında Ödenecek KV Tutarı (Üretim)\n"]
[null,"Genel Orana Tabi Matrah (Diğer)",{"$f":"D130","v":150000},{"$f":"L130","v":34500},"Diğer Faalilyetlerden Elde Edilen Kazanç"]
[null,null,{"$f":"IFERROR(D147/C147,0)","v":0.23}]
[null,"MATRAHLAR TOPLAMI",{"$f":"C137+C144+C141+C147","v":500000},{"$f":"D140+D146+D143+D147","v":111500}]

{"sheet":"32-1-1-11 Ö","index":17,"n_rows":149,"n_cols":12,"rows_kept":149,"cut":false,"hidden":true,"merged":[[84,2,84,6],[1,1,2,1],[59,1,59,2],[60,1,60,2],[71,1,72,1],[73,1,73,2],[74,1,74,2],[74,3,74,4],[75,1,75,2],[75,3,75,4],[79,1,79,3],[82,2,82,6],[85,2,85,6],[87,1,89,1],[87,2,88,2],[87,3,88,3],[87,4,88,4],[87,5,88,5],[135,1,135,4],[137,1,138,2],[104,11,107,11],[109,11,112,11],[114,11,117,11],[119,11,122,11],[124,11,127,11],[128,7,133,8],[129,11,132,11]]}
[]
[null,"FAALİYET TÜRLERİ İTİBARİYLE HASILATLAR VE TOPLAM İÇİNDEKİ ORANLARI",{"$f":"IFERROR(C4/C4,0)","v":1},{"$f":"IFERROR(D4/C4,0)","v":0.75},{"$f":"IFERROR(E4/C4,0)","v":0},{"$f":"IFERROR(F4/C4,0)","v":0.25}]
[null,null,"Toplam Hasılat","İhracat faaliyeti","İmalat faaliyeti","Diğer faaliyetler"]
[null,"A-BRÜT SATIŞLAR (60)",{"$f":"D4+E4+F4","v":2000000},{"$f":"SUM(D5:D7)","v":1500000},{"$f":"SUM(E5:E7)","v":0},500000]
[null,"1-Yurtiçi Satışlar (600)",{"$f":"D5+E5+F5","v":500000},null,null,500000]
[null,"2-Yurtdışı Satışlar (601)",{"$f":"D6+E6+F6","v":1500000},1500000]
[null,"3-Diğer Gelirler (602)",{"$f":"D7+E7+F7","v":0}]
[null,"B-SATIŞ İNDİRİMLERİ(-) (61)",{"$f":"SUM(C9:C11)","v":0},{"$f":"SUM(D9:D11)","v":0},{"$f":"SUM(E9:E11)","v":0},0]
[null,"1-Satıştan İadeler (-) (610)",{"$f":"SUM(D9:F9)","v":0}]
[null,"2- Satış İskontoları (-) (611)",{"$f":"SUM(D10:F10)","v":0}]
[null,"3-Diğer İndirimler (-) (612)",0]
[null,"C-NET SATIŞLAR",{"$f":"C4-C8","v":2000000},{"$f":"D4-D8","v":1500000},{"$f":"E4-E8","v":0},500000]
[null,"D-SATIŞLARIN MALİYETİ (-) (62)",{"$f":"SUM(C14:C17)","v":0},{"$f":"SUM(D14:D17)","v":0},{"$f":"SUM(E14:E17)","v":0},{"$f":"SUM(F14:F17)","v":0}]
[null,"1-Satılan Mamuller Maliyeti ( 620)",{"$f":"SUM(D14:F14)","v":0}]
[null,"2-Satılan Ticari Mal Maliyeti (621)",{"$f":"SUM(D15:F15)","v":0}]
[null,"3-Satılan Hizmet Maliyeti (622)",0]
[null,"4-Diğer Satışların Maliyeti (623)",0]
[null,"BRÜT SATIŞ KARI / ZARARI",{"$f":"C12-C13","v":2000000},{"$f":"D12-D13","v":1500000},{"$f":"E12-E13","v":0},500000]
[null,"E-FAALİYET GİDERLERİ (-) (63)",{"$f":"SUM(C20:C24)","v":0},{"$f":"SUM(D20:D24)","v":0},{"$f":"SUM(E20:E24)","v":0},0]
[null,"1-Araştırma ve Geliştirme Giderleri(-) (630)",{"$f":"SUM(D20:F20)","v":0}]
[null,"2-Pazarlama, Satış ve Dağıtım Giderleri(-) (631)",{"$f":"SUM(D21:F21)","v":0}]
[null,"3-Genel Yönetim Giderleri(-) (632)",{"$f":"SUM(D22:F22)","v":0}]
[null,"MÜŞTEREK GENEL GİDERLER (DAĞITIM-HASILAT PAYINA GÖRE)",null,{"$f":"C23*D2","v":0},{"$f":"C23*E2","v":0},{"$f":"C23*F2","v":0}]
[null,"MÜŞTEREK GENEL GİDER GİBİ DAĞITIMA TABİ TUTULACAK AMORTİSMAN GİDERLERİ  (DAĞITIM-HASILAT PAYINA GÖRE)",null,{"$f":"C24*D2","v":0},{"$f":"C24*E2","v":0},{"$f":"C24*F2","v":0}]
[null,"FAALİYET KARI / ZARARI ",{"$f":"C18-C19","v":2000000},{"$f":"D18-D19","v":1500000},{"$f":"E18-E19","v":0},500000]
[null,"F-DİĞER FAALİYETLERDEN OLAĞAN GELİR VE KARLAR (64)",{"$f":"SUM(C27:C35)","v":0},{"$f":"SUM(D27:D35)","v":0},{"$f":"SUM(E27:E35)","v":0},{"$f":"SUM(F27:F35)","v":0}]
[null,"         1- İŞTİRAKLERDEN TEMETTÜ GELİRLERİ (640)",{"$f":"SUM(D27:F27)","v":0}]
[null,"         2- BAĞLI ORTAKLIKLARDAN TEMETTÜ GELİRLERİ (641)",{"$f":"SUM(D28:F28)","v":0}]
[null,"         3- FAİZ GELİRLERİ (642) (ihracat ve imalat kaynaklı alacağın tahsiline kadar olan süreçte oluşan)",0]
[null,"         4- KOMİSYON GELİRLERİ (643)",0]
[null,"         5- KONUSU OLMAYAN KARŞILIKLAR (644)",0]
[null,"         6- MENKUL KIYMET SATIŞ KARLARI (645)",0]
[null,"         7- KAMBİYO KARLARI (646) (ihracat ve imalat kaynaklı alacağın tahsiline kadar olan süreçte oluşan)",0]
[null,"         8- REESKONT FAİZ GELİRLERİ (647)",0]
[null,"         9- FAALİYETLE İLGİLİ DİĞER GELİR VE KARLAR (649)",0]
[null,"ARA TOPLAM",{"$f":"C25+C26","v":2000000},{"$f":"D25+D26","v":1500000},{"$f":"E25+E26","v":0},{"$f":"F25+F26","v":500000}]
[null,"G-DİĞER FAALİYETLERDEN OLAĞAN GİDER VE ZARARLAR(-) (65)",{"$f":"SUM(C38:C43)","v":0},{"$f":"SUM(D38:D43)","v":0},{"$f":"SUM(E38:E43)","v":0},0]
[null,"         1- KOMİSYON GİDERLERİ (653)",{"$f":"SUM(D38:F38)","v":0}]
[null,"         2- KARŞILIK GİDERLERİ (654)",{"$f":"SUM(D39:F39)","v":0}]
[null,"         3- MENKUL KIYMET SATIŞ ZARARLARI (655)",0]
[null,"         4- KAMBİYO ZARARLARI (656) (ihracat ve imalat kaynaklı alacağın tahsiline kadar olan süreçte oluşan)",0]
[null,"         5- REESKONT FAİZ GİDERLERİ (657)",0]
[null,"         6- DİĞER OLAĞAN GİDER VE ZARARLAR (659)",{"$f":"SUM(D43:F43)","v":0}]
[null,"ARA TOPLAM",{"$f":"C36-C37","v":2000000},{"$f":"D36-D37","v":1500000},{"$f":"E36-E37","v":0},500000]
[null,"H-FİNANSMAN GİDERLERİ(-) (66)",{"$f":"SUM(C46:C49)","v":0},{"$f":"SUM(D46:D49)","v":0},{"$f":"SUM(E46:E49)","v":0},{"$f":"SUM(F46:F49)","v":0}]
[null,"         1- KISA VADELİ BORÇLANMA GİDERLERİ (-)",{"$f":"SUM(D46:F46)","v":0}]
[null,"         2- UZUN VADELİ BORÇLANMA GİDERLERİ (-)",{"$f":"SUM(D47:F47)","v":0}]
[null,"         1- KISA VADELİ BORÇLANMA GİDERLERİ (-) (DAĞITIM)",null,{"$f":"C48*D2","v":0},{"$f":"C48*E2","v":0},{"$f":"C48*F2","v":0}]
[null,"         2- UZUN VADELİ BORÇLANMA GİDERLERİ (-) (DAĞITIM)",null,{"$f":"C49*D2","v":0},{"$f":"C49*E2","v":0},{"$f":"C49*F2","v":0}]
[null,"ARA TOPLAM",{"$f":"C44-C45","v":2000000},{"$f":"D44-D45","v":1500000},{"$f":"E44-E45","v":0},{"$f":"F44-F45","v":500000}]
[null,"I-OLAĞANDIŞI GELİR VE KÂRLAR (67)",{"$f":"SUM(D51:F51)","v":0},{"$f":"SUM(D52:D53)","v":0},{"$f":"SUM(E52:E53)","v":0},{"$f":"SUM(F52:F53)","v":0}]
[null,"1- ÖNCEKİ DÖNEM GELİR VE KARLARI (671)",{"$f":"SUM(D52:F52)","v":0}]
[null,"2-DİĞER OLAĞAN DIŞI GELİR VE KARLAR (679)",{"$f":"SUM(D53:F53)","v":0}]
[null,"ARA TOPLAM",{"$f":"SUM(D54:F54)","v":2000000},{"$f":"D50+D51","v":1500000},{"$f":"E50+E51","v":0},500000]
[null,"J-OLAĞANDIŞI GİDER VE ZARARLAR(-) (68)",{"$f":"SUM(C56:C58)","v":0},{"$f":"SUM(D56:D58)","v":0},{"$f":"SUM(E56:E58)","v":0},0]
[null,"1-Çalışmayan Kısım Gider ve Zararları(-) (680)",{"$f":"SUM(D56:F56)","v":0}]
[null,"2-Önceki Dönem Gider ve Zararları(-) (681)",{"$f":"SUM(D57:F57)","v":0}]
[null,"3-Diğer Olağan Dışı Gider ve Zararlar(-) (689)",0]
[null,"DÖNEM KÂRI VEYA ZARARI \n(TİCARİ BİLANÇO KARI ZARARI )",{"$f":"C54-C55","v":2000000},{"$f":"D54-D55","v":1500000},{"$f":"E54-E55","v":0},500000]
[null,"İHRACAT, İMALAT VE DİĞER FAALİYETLERDEN ELDE EDİLEN KAZANCIN TOPLAM TİCARİ KAZANÇ İÇİNDEKİ PAYLARI  \n\n(Kazançlar arasında Öncelik İhracat Kazancına Verilmiştir. İhrcat Kazancından arta kalan Ticari Kazanç İmalat ve Diğer Faaliyetlere Sayılmıştır.)\n\n",null,{"$f":"IF(D59>=$C$59,1,\n    IF(D59<=0,0,\n    IF(AND(D59>0,D59<$C$59),D59/$C$59)))","v":0.75},{"$f":"IF(E59>=$C$59,1,\n    IF(E59<=0,0,\n    IF(AND(E59>0,E59<$C$59),E59/$C$59)))","v":0},{"$f":"IF(F59>=$C$59,1,\n    IF(F59<=0,0,\n    IF(AND(F59>0,F59<$C$59),F59/$C$59)))","v":0.25}]
[null,null,null,{"$f":"D60/(D60+E60+F60)","v":0.75},{"$f":"E60/(D60+E60+F60)","v":0},{"$f":"F60/(D60+E60+F60)","v":0.25}]
[]
[null,"KKEG +"]
[null," KABUL EDİLMEYEN GELİRLER -"]
[null,"ZARAR OLSA DAHİ İNDİRİLECEK İSTİSNALAR -",{"$f":"C66+C67+C68","v":0}]
[null,"Hizmet İhracatı Faaliyetinden (KVK 10-1/ğ) Elde Edilen Kazançlardan İstisna Edilenlerin Toplamı"]
[null,"İmalat Faaliyetinden Elde Edilen Kazançlardan İstisna Edilenlerin Toplamı"]
[null,"Diğer Faaliyetlerden Elde Edilen Kazançlardan İstisna Edilenlerin Toplamı"]
[null,"GEÇMİŞ YIL ZARARLARI -"]
[null,"İNDİRİMLER -",null,"AZAMİ YAZILABİLECEK İNDİRİMLER TUTARI",{"$f":"C59+C63-C64-C65-C69","v":2000000}]
[]
[null,"1 PUAN İNDİRİM UYGULANACAK TUTARIN HESABINDA İSTİSNA KAZANÇLAR DÜŞÜLDÜKTEN SONRA BULUNAN TİCARİ KAZANÇ TUTARI İLE  İHRACAT,İMALAT VE DİĞER KAZANÇLARIN TUTARI","TİCARİ KAZANÇ TAN İhracat ve İmalat Kazancından İstisna Olan Tutarlar Düşüldükten Sonra Kalan Tutarı","İhracat Faaliyetinden Elde Edilen  Kazançtan İstisna Olan Kısım Düşüldükten Sonra Bulunan Tutarı","Üretim  Faaliyetinden Elde Edilen  Kazançtan İstisna Olan Kısım Düşüldükten Sonra Bulunan Tutarı","Diğer Faaliyetinden Elde Edilen  Kazanç"]
[null,null,{"$f":"IF(C59-C66-C67<=0,0,C59-C66-C67)","v":2000000},{"$f":"IF($D$59-C66<=0,0,MIN($D$59-C66,$C$73*D60))","v":1500000},{"$f":"IF($E$59-C67<=0,0,MIN($E$59-C67,$C$73*E60))","v":0},{"$f":"IF(C73-D73-E73<=0,0,C73-D73-E73)","v":500000}]
[null,"MATRAH DAĞITIM PAYLARI",null,{"$f":"IFERROR(IF(D73/C73<=0,0,D73/C73),0)","v":0.75},{"$f":"IFERROR(IF(E73/C73<=0,0,E73/C73),0)","v":0},{"$f":"IFERROR(F73/C73,0)","v":0.25}]
[null,"İHRACAT, İMALAT VE DİĞER FAALİYETLERDEN ELDE EDİLEN KAZANCIN TOPLAM TİCARİ KAZANÇ İÇİNDEKİ PAYLARI ",null,{"$f":"IFERROR(IF(AND(D73+E73>C73, F73<=0),1,(D73+E73)/C73),0)","v":0.75},null,{"$f":"IFERROR(IF(F73<=0,0,F73/C73),0)","v":0.25}]
[null,"NEGATİF VE % 100 DEN BÜYÜKLÜK KONTROLÜ SONRASINDAKİ PAYLARI",null,{"$f":"IFERROR(IF(D75<=0,0,IF(D75>1,1,D75)),0)","v":0.75},null,{"$f":"IFERROR(IF(F75<=0,0,IF(F75>1,1,F75)),0)","v":0.25}]
[]
[null,"SAFİ KURUM KAZANCI \n(KURUMLAR VERGİSİ MATRAHI)",{"$f":"C59+C63-C64-C65-C69-C70","v":2000000},{"$f":"IF(C78<0, \"ZARAR\",\"KAR\")","v":"KAR"}]
[]
[null,"2022 YILI 3. DÖNEM İNDİRİMLİ KURUMLAR VERGİSİ HESAPLAMA TABLOSU"]
[null,null,"1. TEŞVİK BELGESİ","2. TEŞVİK BELGESİ","3. TEŞVİK BELGESİ","4. TEŞVİK BELGESİ","5. TEŞVİK BELGESİ"]
[null,"Vergi İndirim Oranı (VİO)",0.8]
[null,"KV MATRAHI (Safi Kurum Kazancı)",{"$f":"C78","v":2000000}]
[null,"32/A  Uygulanacak K.V. Matrahı (HER BİR TEŞVİK BELGESİ KAPSAMINDA YARARLANILABİLECEK YATIRIMA KATKI TUTARININ MATRAHI BU HÜCRELERE YAZILMALIDIR)",2000000,null,null,null,null,{"$f":"IF(SUM(C84:G84)>C78,\"32/A İNDİRİMİ UYGULANACAK KAZANÇ, SAFİ KURUM KAZANCINDAN FAZLADIR\",SUM(C84:G84))","v":2000000}]
[null,"32/A UYGULANMAYACAK K.V.  Matrahı",{"$f":"IF(C83-(C84+D84+E84+F84+G84)<0,0,C83-(C84+D84+E84+F84+G84))","v":0}]
[null,"MATRAH TOPLAMI",{"$f":"IF((C84+D84+E84+F84+G84+C85)>C78,C78,(C84+D84+E84+F84+G84+C85))","v":2000000}]
[]
[null,"SAFİ KURUM KAZANCININ  KV VERGİ ORANLARI İTİBARİYLE DAĞILIMI ","TOPLAM SAFİ KAZANÇ","İhracat Kazancı Payı","Üretim Kazancı Payı","Diğer Faaliyet Kazancı Payı"]
[]
[null,null,{"$f":"C78","v":2000000},{"$f":"IF(AND(AND($D$59>0,($D$59+$E$59)>=$C$59,D59>=C66),$C$90>=MAX(D59,D73)),\n\nMIN(MAX(IF(D59<=C90,D59,IF(D73<=C90,D73)),$C$90*D74)),\n\nIF(OR(D59<=0,D73<=0),0,\n\nMIN( MAX(   MAX(   IF(D59<=C90,D59),  IF(D73<=C90,D73) ),    MIN($C$90*D74,D59,D73)),$C$90)))","v":1500000},{"$f":"MIN( IF(AND(AND($E$59>0,($D$59+$E$59)>=$C$59,E59>=C67),$C$90>=MAX(E59,E73)),\n\nMIN(MAX(IF(E59<=C90,E59,IF(E73<=C90,E73)),$C$90*E74)),\n\nIF(OR(E59<=0,E73<=0),0,\n\nMIN( MAX(   MAX(   IF(E59<=C90,E59),  IF(E73<=C90,E73) ),    MIN($C$90*E74,E59,E73)),$C$90))),C90-D90)","v":0},{"$f":"C90-D90-E90","v":500000}]
[null,"SAFİ KURUM KAZANCININ DAĞILIMI ORANSAL DAĞILIMI",{"$f":"C90","v":2000000},{"$f":"D90/C90","v":0.75},{"$f":"E90/C90","v":0},{"$f":"F90/C90","v":0.25}]
[null,"SAFİ KURUM KAZANCININ DAĞILIMI TUTARSAL",{"$f":"C91","v":2000000},{"$f":"D90","v":1500000},{"$f":"E90","v":0},{"$f":"F90","v":500000}]
[null,"SAFİ KURUM KAZANCI DAĞILIMI",{"$f":"C92","v":2000000},{"$f":"IFERROR(IF(D92/C92>=1,1,D92/C92),0)","v":0.75},{"$f":"IFERROR(IF(E92/C92>=1,1,E92/C92),0)","v":0},{"$f":"IFERROR(IF(F92/C92>=1,1,F92/C92),0)","v":0.25},null,"KV ORANI"]
[null,"1 PUAN VE 32/A İNDİRİMİ OLMASAYDI HESAPLANAN KV TUTARI",{"$f":"C93*$H$94","v":500000},{"$f":"D92*$H$94","v":375000},{"$f":"E92*$H$94","v":0},{"$f":"F92*$H$94","v":125000},null,0.25]
[null,"32/ A UYGULANAN MATRAH",{"$f":"C84+D84+E84+F84+G84","v":2000000},{"$f":"D107+D112+D117+D122+D127","v":1500000},{"$f":"D106+D111+D116+D121+D126","v":0},{"$f":"D105+D110+D115+D120+D125","v":500000}]
[null,"32/A UYGULANACAK MATRAH ÜZERİNDEN ÖDENECEK KV TUTARI",{"$f":"J108+J113+J118+J123+J128","v":84999.999999999971},{"$f":"J107+J112+J117+J122+J127","v":59999.999999999971},{"$f":"J106+J111+J116+J121+J126","v":0},{"$f":"J105+J110+J115+J120+J125","v":24999.999999999993}]
[null,"32/A UYGULANMAYAN MATRAH",{"$f":"IF(C85<=0,0,C85)","v":0},{"$f":"D132","v":0},{"$f":"D131","v":0},{"$f":"D130","v":0}]
[null,"32/A UYGULANMAYAN MATRAH ÜZERİNDEN ÖDENECEK KV TUTARI",{"$f":"L130","v":0},{"$f":"J132","v":0},{"$f":"J131","v":0},{"$f":"J130","v":0}]
[null,"TOPLAM ÖDENECEK KV",{"$f":"C96+C98","v":84999.999999999971},{"$f":"J132+J107","v":59999.999999999971},{"$f":"J131+J106","v":0},{"$f":"J130+J105","v":24999.999999999993}]
[null,"TOPLAM AVANTAJ  (YARARLANILAN 1 PUAN İNDİRİMİ + 32/A İNDİRİMİ TUTARI )",{"$f":"C94-C99","v":415000},{"$f":"D101+D102","v":315000},{"$f":"E101+E102","v":0},{"$f":"F101+F102","v":100000}]
[null,"YARARLANILAN 1 - 5 PUAN İNDİRİMİ TUTARI",{"$f":"F133+F128+F123+F118+F113+F108","v":75000},{"$f":"F132+F107+F112+F117+F122+F127","v":75000},{"$f":"F131+F106+F111+F116+F121+F126","v":0},{"$f":"F130+F105+F110+F115+F120+F125","v":0}]
[null,"YARLANILAN 32/A İNDİRİMİ TUTARI",{"$f":"K108+K113+K118+K123+K128+K133","v":340000},{"$f":"K107+K112+K122+K127+K132","v":240000.00000000003},{"$f":"K106+K111+K116+K121+K126+K131","v":0},{"$f":"K105++K110+K115+K120+K125+K130","v":100000}]
[]
[null,"32/A UYGULANABİLECEK MATRAH (1.TEŞVİK BELGESİ)",{"$f":"C84","v":2000000},"KV MATRAHI","1 - 5 PUAN İNDİRİM OLMASAYDI HESAPLANAN KV TUTARI","1 -5 Puan İndirim Tutarı","1 - 5 Puan İndirim Sonrasında Hesaplanan KV Tutarı","32/A İndirimi Olmasaydı Ödenecek KV Tutarı","1 -5 Puan İndirim ve 32/A VİO Uygulandıktan Sonra Tatbik Edilecek KV Oranı","1 -5 Puan İndirim ve 32/A İndirimi Uygulandıktan Sonra Ödenecek  KV Tutarı","Yararlanılan Yatırıma Katkı Tutarı\n(32/A İnd. KV Nedeniyle Vazgeçilen Vergi Tutarı)","Ödenecek KV Tutarı"]
[null,"GENEL ORANA TABİ KISIM (DİĞER FAALİYETLER)",{"$f":"F93","v":0.25},{"$f":"C104*C105","v":500000},{"$f":"D105*$H$94","v":125000},0,{"$f":"E105-F105","v":125000},{"$f":"G105","v":125000},{"$f":"($H$94)-(($H$94)*$C$82)","v":4.9999999999999989E-2},{"$f":"I105*D105","v":24999.999999999993},{"$f":"G105-J105","v":100000},{"$f":"J108","v":84999.999999999971}]
[null,"1 PUAN İNDİRİMLİ ORANA TABİ KISIM  (İMALAT)",{"$f":"E93","v":0},{"$f":"C104*C106","v":0},{"$f":"D106*$H$94","v":0},{"$f":"D106/100","v":0},{"$f":"E106-F106","v":0},{"$f":"G106","v":0},{"$f":"($H$94-0.01)-(($H$94-0.01)*$C$82)","v":4.7999999999999987E-2},{"$f":"I106*D106","v":0},{"$f":"G106-J106","v":0}]
[null,"5 PUAN İNDİRİMLİ ORANA TABİ KISIM  ( İHRACAT)",{"$f":"D93","v":0.75},{"$f":"C104*C107","v":1500000},{"$f":"D107*$H$94","v":375000},{"$f":"D107/20","v":75000},{"$f":"E107-F107","v":300000},300000,{"$f":"($H$94-0.05)-(($H$94-0.05)*C82)","v":3.999999999999998E-2},59999.999999999971,{"$f":"G107-J107","v":240000.00000000003}]
[null,"TOPLAM",{"$f":"SUM(C105:C107)","v":1},{"$f":"SUM(D105:D107)","v":2000000},500000,{"$f":"SUM(F105:F107)","v":75000},{"$f":"SUM(G105:G107)","v":425000},{"$f":"SUM(H105:H107)","v":425000},null,84999.999999999971,340000]
[null,"32/A UYGULANABİLECEK MATRAH (2.TEŞVİK BELGESİ)",{"$f":"D84","v":0},"KV MATRAHI","1 - 5 PUAN İNDİRİM OLMASAYDI HESAPLANAN KV TUTARI","1 -5 Puan İndirim Tutarı","1 -5 Puan İndirim Sonrasında Hesaplanan KV Tutarı","32/A İndirimi Olmasaydı Ödenecek KV Tutarı","1 - 5 Puan İndirim ve 32/A VİO Uygulandıktan Sonra Tatbik Edilecek KV Oranı","1-5  Puan İndirim ve 32/A İndirimi Uygulandıktan Sonra Ödenecek  KV Tutarı","Yararlanılan Yatırıma Katkı Tutarı\n(32/A İnd. KV Nedeniyle Vazgeçilen Vergi Tutarı)","Ödenecek KV Tutarı"]
[null,"GENEL ORANA TABİ KISIM (DİĞER FAALİYETLER)",{"$f":"F93","v":0.25},{"$f":"C109*C110","v":0},{"$f":"D110*$H$94","v":0},0,{"$f":"E110-F110","v":0},{"$f":"G110","v":0},{"$f":"($H$94)-(($H$94)*D82)","v":0.25},{"$f":"I110*D110","v":0},{"$f":"G110-J110","v":0},{"$f":"J113","v":0}]
[null,"1 PUAN İNDİRİMLİ ORANA TABİ KISIM  (İMALAT)",{"$f":"E93","v":0},{"$f":"C109*C111","v":0},{"$f":"D111*$H$94","v":0},{"$f":"D111/100","v":0},{"$f":"E111-F111","v":0},{"$f":"G111","v":0},{"$f":"($H$94-0.01)-(($H$94-0.01)*D82)","v":0.24},{"$f":"I111*D111","v":0},{"$f":"G111-J111","v":0}]
[null,"5 PUAN İNDİRİMLİ ORANA TABİ KISIM  ( İHRACAT)",{"$f":"D93","v":0.75},{"$f":"C109*C112","v":0},{"$f":"D112*$H$94","v":0},{"$f":"D112/20","v":0},{"$f":"E112-F112","v":0},0,{"$f":"($H$94-0.05)-(($H$94-0.05)*D82)","v":0.2},0,{"$f":"G112-J112","v":0}]
[null,"TOPLAM",{"$f":"SUM(C110:C112)","v":1},0,0,{"$f":"SUM(F110:F112)","v":0},{"$f":"SUM(G110:G112)","v":0},{"$f":"SUM(H110:H112)","v":0},null,{"$f":"SUM(J110:J112)","v":0},0]
[null,"32/A UYGULANABİLECEK MATRAH (3.TEŞVİK BELGESİ)",{"$f":"E84","v":0},"KV MATRAHI","1 - 5 PUAN İNDİRİM OLMASAYDI HESAPLANAN KV TUTARI","1-5 Puan İndirim Tutarı","1 - 5 Puan İndirim Sonrasında Hesaplanan KV Tutarı","32/A İndirimi Olmasaydı Ödenecek KV Tutarı","1 - 5 Puan İndirim ve 32/A VİO Uygulandıktan Sonra Tatbik Edilecek KV Oranı","1 -5 Puan İndirim ve 32/A İndirimi Uygulandıktan Sonra Ödenecek  KV Tutarı","Yararlanılan Yatırıma Katkı Tutarı\n(32/A İnd. KV Nedeniyle Vazgeçilen Vergi Tutarı)","Ödenecek KV Tutarı"]
[null,"GENEL ORANA TABİ KISIM (DİĞER FAALİYETLER)",{"$f":"F93","v":0.25},{"$f":"C114*C115","v":0},{"$f":"D115*$H$94","v":0},0,{"$f":"E115-F115","v":0},{"$f":"G115","v":0},{"$f":"($H$94)-(($H$94)*E82)","v":0.25},{"$f":"I115*D115","v":0},{"$f":"G115-J115","v":0},{"$f":"J118","v":0}]
[null,"1 PUAN İNDİRİMLİ ORANA TABİ KISIM  (İMALAT)",{"$f":"E93","v":0},{"$f":"C114*C116","v":0},{"$f":"D116*$H$94","v":0},{"$f":"D116/100","v":0},{"$f":"E116-F116","v":0},{"$f":"G116","v":0},{"$f":"($H$94-0.01)-(($H$94-0.01)*E82)","v":0.24},{"$f":"I116*D116","v":0},{"$f":"G116-J116","v":0}]
[null,"5 PUAN İNDİRİMLİ ORANA TABİ KISIM  ( İHRACAT)",{"$f":"D93","v":0.75},{"$f":"C114*C117","v":0},{"$f":"D117*$H$94","v":0},{"$f":"D117/20","v":0},{"$f":"E117-F117","v":0},0,{"$f":"($H$94-0.05)-(($H$94-0.05)*E82)","v":0.2},0,{"$f":"G117-J117","v":0}]
[null,"TOPLAM",{"$f":"SUM(C115:C117)","v":1},0,0,{"$f":"SUM(F115:F117)","v":0},{"$f":"SUM(G115:G117)","v":0},{"$f":"SUM(H115:H117)","v":0},null,{"$f":"SUM(J115:J117)","v":0},0]
[null,"32/A UYGULANABİLECEK MATRAH (4. TEŞVİK BELGESİ)",{"$f":"F84","v":0},"KV MATRAHI","1 - 5 PUAN İNDİRİM OLMASAYDI HESAPLANAN KV TUTARI","1-5 Puan İndirim Tutarı","1 -5 Puan İndirim Sonrasında Hesaplanan KV Tutarı","32/A İndirimi Olmasaydı Ödenecek KV Tutarı","1- 5  Puan İndirim ve 32/A VİO Uygulandıktan Sonra Tatbik Edilecek KV Oranı","1-5 Puan İndirim ve 32/A İndirimi Uygulandıktan Sonra Ödenecek  KV Tutarı","Yararlanılan Yatırıma Katkı Tutarı\n(32/A İnd. KV Nedeniyle Vazgeçilen Vergi Tutarı)","Ödenecek KV Tutarı"]
[null,"GENEL ORANA TABİ KISIM (DİĞER FAALİYETLER)",{"$f":"F93","v":0.25},{"$f":"C119*C120","v":0},{"$f":"D120*$H$94","v":0},0,{"$f":"E120-F120","v":0},{"$f":"G120","v":0},{"$f":"($H$94)-(($H$94)*F82)","v":0.25},{"$f":"I120*D120","v":0},{"$f":"G120-J120","v":0},{"$f":"J123","v":0}]
[null,"1 PUAN İNDİRİMLİ ORANA TABİ KISIM  (İMALAT)",{"$f":"E93","v":0},{"$f":"C119*C121","v":0},{"$f":"D121*$H$94","v":0},{"$f":"D121/100","v":0},{"$f":"E121-F121","v":0},{"$f":"G121","v":0},{"$f":"($H$94-0.01)-(($H$94-0.01)*F82)","v":0.24},{"$f":"I121*D121","v":0},{"$f":"G121-J121","v":0}]
[null,"5 PUAN İNDİRİMLİ ORANA TABİ KISIM  ( İHRACAT)",{"$f":"D93","v":0.75},{"$f":"C119*C122","v":0},{"$f":"D122*$H$94","v":0},{"$f":"D122/20","v":0},{"$f":"E122-F122","v":0},0,{"$f":"($H$94-0.05)-(($H$94-0.05)*F82)","v":0.2},0,{"$f":"G122-J122","v":0}]
[null,"TOPLAM",{"$f":"SUM(C120:C122)","v":1},0,0,{"$f":"SUM(F120:F122)","v":0},{"$f":"SUM(G120:G122)","v":0},{"$f":"SUM(H120:H122)","v":0},null,{"$f":"SUM(J120:J122)","v":0},0]
[null,"32/A UYGULANABİLECEK MATRAH (5.TEŞVİK BELGESİ)",{"$f":"G84","v":0},"KV MATRAHI","1 - 5 PUAN İNDİRİM OLMASAYDI HESAPLANAN KV TUTARI","1-5 Puan İndirim Tutarı","1 - 5 Puan İndirim Sonrasında Hesaplanan KV Tutarı","32/A İndirimi Olmasaydı Ödenecek KV Tutarı","1 -5 Puan İndirim ve 32/A VİO Uygulandıktan Sonra Tatbik Edilecek KV Oranı","1 - 5 Puan İndirim ve 32/A İndirimi Uygulandıktan Sonra Ödenecek  KV Tutarı","Yararlanılan Yatırıma Katkı Tutarı\n(32/A İnd. KV Nedeniyle Vazgeçilen Vergi Tutarı)","Ödenecek KV Tutarı"]
[null,"GENEL ORANA TABİ KISIM (DİĞER FAALİYETLER)",{"$f":"F93","v":0.25},{"$f":"C124*C125","v":0},{"$f":"D125*$H$94","v":0},0,{"$f":"E125-F125","v":0},{"$f":"G125","v":0},{"$f":"($H$94)-(($H$94)*G82)","v":0.25},{"$f":"I125*D125","v":0},{"$f":"G125-J125","v":0},{"$f":"J128","v":0}]
[null,"1 PUAN İNDİRİMLİ ORANA TABİ KISIM  (İMALAT)",{"$f":"E93","v":0},{"$f":"C124*C126","v":0},{"$f":"D126*$H$94","v":0},{"$f":"D126/100","v":0},{"$f":"E126-F126","v":0},{"$f":"G126","v":0},{"$f":"($H$94-0.01)-(($H$94-0.01)*G82)","v":0.24},{"$f":"I126*D126","v":0},{"$f":"G126-J126","v":0}]
[null,"5 PUAN İNDİRİMLİ ORANA TABİ KISIM  ( İHRACAT)",{"$f":"D93","v":0.75},{"$f":"C124*C127","v":0},{"$f":"D127*$H$94","v":0},{"$f":"D127/20","v":0},{"$f":"E127-F127","v":0},0,{"$f":"($H$94-0.05)-(($H$94-0.05)*G82)","v":0.2},0,{"$f":"G127-J127","v":0}]
[null,"TOPLAM",{"$f":"SUM(C125:C127)","v":1},0,0,{"$f":"SUM(F125:F127)","v":0},{"$f":"SUM(G125:G127)","v":0},{"$f":"SUM(H125:H127)","v":0},null,{"$f":"SUM(J125:J127)","v":0},0]
[null,"32/A UYGULANAMAYACAK MATRAH",{"$f":"IF(C85<=0,0,C85)","v":0},"KV MATRAHI","1-5 PUAN İNDİRİM OLMASAYDI HESAPLANAN KV TUTARI","1-5 Puan İndirim Tutarı","1 -5 Puan İndirim Sonrasında Hesaplanan KV Tutarı","32/A İNDİRİMİ UYGULANMAZ",null,"1 Puan İndirim ve 32/A İndirimi Uygulandıktan Sonra Ödenecek  KV Tutarı","Yararlanılan Yatırıma Katkı Tutarı\n(32/A İnd. KV Nedeniyle Vazgeçilen Vergi Tutarı)","Ödenecek KV Tutarı"]
[null,"GENEL ORANA TABİ KISIM (DİĞER FAALİYETLER)",{"$f":"F93","v":0.25},{"$f":"C129*C130","v":0},{"$f":"D130*$H$94","v":0},0,{"$f":"E130-F130","v":0},null,null,{"$f":"G130","v":0},{"$f":"G130-J130","v":0},{"$f":"J133","v":0}]
[null,"1 PUAN İNDİRİMLİ ORANA TABİ KISIM  (İMALAT)",{"$f":"E93","v":0},{"$f":"C131*C129","v":0},{"$f":"D131*$H$94","v":0},{"$f":"D131/100","v":0},{"$f":"E131-F131","v":0},null,null,{"$f":"G131","v":0},{"$f":"G131-J131","v":0}]
[null,"5 PUAN İNDİRİMLİ ORANA TABİ KISIM  ( İHRACAT)",{"$f":"D93","v":0.75},{"$f":"C132*C129","v":0},{"$f":"D132*$H$94","v":0},{"$f":"D132/20","v":0},{"$f":"E132-F132","v":0},null,null,0,0]
[null,"TOPLAM",{"$f":"SUM(C130:C132)","v":1},{"$f":"SUM(D130:D132)","v":0},0,{"$f":"SUM(F130:F132)","v":0},{"$f":"SUM(G130:G132)","v":0},null,null,0,0]
[null,"TOPLAM KV MATRAHI VE ÖDENMESİ GEREKEN KV ",{"$f":"C104+C129+C109+C114+C119+C124","v":2000000},{"$f":"D108+D133+D113+D118+D123+D128","v":2000000},{"$f":"E108+E133+E113+E118+E123+E128","v":500000},{"$f":"F108+F133+F113+F118+F123+F128","v":75000},{"$f":"G108+G133+G113+G118+G123+G128","v":425000},null,null,{"$f":"J108+J133+J113+J118+J123+J128","v":84999.999999999971},{"$f":"K133+K108+K113+K118+K123+K128","v":340000},{"$f":"L105+L130+L110+L115+L120+L125","v":84999.999999999971}]
[]
[null,"GEÇİCİ VERGİ BEYANNMESİNDE MATRAH BİLDİRİMİ BÖLÜMÜNDE DOLDURULACAK KISIMLAR VE TUTARLARI"]
[null,"32 A Madde Kapsamında İndirimli Kurumlar Vergisine (Geçici Vergiye) Tabi Matrah",{"$f":"C104+C109+C114+C119+C124","v":2000000},{"$f":"E108+E113+E118+E123+E128","v":500000},"1-5 Puan Olmasaydı Hesaplan KV Tutarı"]
[null,null,null,{"$f":"G108+G113+G118+G123++G128","v":425000},"1 -5 Puan İndirim Sonrasında Ödenecek KV Tutarı\n (32 A olmasaydı hesaplanacak Vergi)"]
[null,null,null,{"$f":"K108+K113+K118+K123+K128","v":340000},"32/A İndirimi ile Vazgeçilen Vergi"]
[null,"32 A Madde Kapsamında İndirimli Kurumlar Vergisi(Geçici Vergi) Oranı",{"$f":"IFERROR(D140/C137,0)","v":4.2499999999999982E-2},{"$f":"L105+L110+L115+L120+L125","v":84999.999999999971},"32/A ya Tabi Matrah Üzerinden Ödenecek KV"]
[null,"32/7 Madde Kapsamında İndirimli Kurumlar Vergisine (Geçici Vergiye) Tabi Matrah  (İhracat)",{"$f":"D132","v":0},{"$f":"E132","v":0},"5 Puan Olmasaydı Hesaplan KV Tutarı"]
[null,null,null,{"$f":"F132","v":0},"5 Puan İndirimin Vergi Etkisi "]
[null,"32/7 Madde Kapsamında İndirimli Kurumlar Vergisi (Geçici Vergi) Oranı",{"$f":"IFERROR(D143/C141,0)","v":0},{"$f":"G132","v":0},"5 Puan İndirim Sonrasında Ödenecek KV Tutarı (İhracat)\n"]
[null,"32/8 Madde Kapsamında İndirimli Kurumlar Vergisine (Geçici Vergiye) Tabi Matrah  (Üretim)",{"$f":"D131","v":0},{"$f":"E131","v":0},"1 Puan Olmasaydı Hesaplan KV Tutarı"]
[null,null,null,{"$f":"F131","v":0},"1 Puan İndirimin Vergi Etkisi "]
[null,"32/8 Madde Kapsamında İndirimli Kurumlar Vergisi (Geçici Vergi) Oranı",{"$f":"IFERROR(D146/C144,0)","v":0},{"$f":"G131","v":0},"1 Puan İndirim Sonrasında Ödenecek KV Tutarı (Üretim)\n"]
[null,"Genel Orana Tabi Matrah (Diğer)",{"$f":"D130","v":0},{"$f":"J130","v":0},"Diğer Faalilyetlerden Elde Edilen Kazanç"]
[null,null,{"$f":"IFERROR(D147/C147,0)","v":0}]
[null,"MATRAHLAR TOPLAMI",{"$f":"C137+C144+C141+C147","v":2000000},{"$f":"D140+D146+D143+D147","v":84999.999999999971}]